Aller au contenu

Filament ABS

erreur 1ere compilation Marlin ( résolue )


Grap

Messages recommandés

Bonjour

j ai recu mes commandes et je commence la configuration du materiel.

j essai de compiler le marlin 2.0 pour une SKR PRO V1.1 en suivant les modes d emploies mais j ai un message d erreur a la 1ere compile.

il reconnait pas le mon et apres ca ... ca part en cascade d erreur ....

 

Vous pouvez m aiguiller un peu pour trouver l erreur ?

il y a seullement que 2 fichiers a transformer ? le platfomio.ini et configuration.h ?

 

> Executing task: C:\Users\GRAP CLONE\.platformio\penv\Scripts\platformio.exe run --environment BIGTREE_SKR_PRO <

Processing BIGTREE_SKR_PRO (platform: ststm32@<6.2.0; board: BigTree_SKR_Pro; framework: arduino)
---------------------------------------------------------------------------------------------------------------------------------------------------------------------------------------------------------------------------------

Verbose mode can be enabled via `-v, --verbose` option
CONFIGURATION: https://docs.platformio.org/page/boards/ststm32/BigTree_SKR_Pro.html
PLATFORM: ST STM32 6.1.1 > STM32F407ZG (192k RAM. 1024k Flash)
HARDWARE: STM32F407ZGT6 168MHz, 192KB RAM, 1MB Flash
DEBUG: Current (stlink) External (jlink, stlink)
PACKAGES:
 - framework-arduinoststm32 4.10700.200103 (1.7.0)
 - toolchain-gccarmnoneeabi 1.90201.191206 (9.2.1)
Converting Marlin.ino
LDF: Library Dependency Finder -> http://bit.ly/configure-pio-ldf
LDF Modes: Finder ~ chain, Compatibility ~ soft
Found 16 compatible libraries
Scanning dependencies...
Dependency Graph
|-- <LiquidCrystal> 1.5.0
|   |-- <Wire> 1.0
|-- <TMCStepper> 0.7.1
|   |-- <SPI> 1.0
|-- <Adafruit MAX31865 library> 1.1.0
|   |-- <SPI> 1.0
|-- <Adafruit NeoPixel> 1.5.0        
|-- <U8glib-HAL> 0.4.1       
|   |-- <Wire> 1.0
|   |-- <SPI> 1.0
|-- <Arduino-L6470> 0.8.0    
|-- <SlowSoftI2CMaster> 1.0.0
|-- <LiquidTWI2> 1.2.7
|   |-- <Wire> 1.0
|-- <SailfishLCD>
|-- <SPI> 1.0
|-- <Servo> 1.1.2
|-- <IWatchdog> 1.0.0
|-- <Wire> 1.0
|-- <EEPROM> 2.0.1
Building in release mode
Compiling .pio\build\BIGTREE_SKR_PRO\FrameworkArduinoVariant\PeripheralPins.c.o
Compiling .pio\build\BIGTREE_SKR_PRO\FrameworkArduinoVariant\variant.cpp.o
Compiling .pio\build\BIGTREE_SKR_PRO\FrameworkArduino\HardwareSerial.cpp.o
Compiling .pio\build\BIGTREE_SKR_PRO\FrameworkArduino\HardwareTimer.cpp.o
Compiling .pio\build\BIGTREE_SKR_PRO\FrameworkArduino\IPAddress.cpp.o
Compiling .pio\build\BIGTREE_SKR_PRO\FrameworkArduino\Print.cpp.o
Compiling .pio\build\BIGTREE_SKR_PRO\FrameworkArduino\RingBuffer.cpp.o
Compiling .pio\build\BIGTREE_SKR_PRO\FrameworkArduino\Stream.cpp.o
Compiling .pio\build\BIGTREE_SKR_PRO\FrameworkArduino\Tone.cpp.o
Compiling .pio\build\BIGTREE_SKR_PRO\FrameworkArduino\USBSerial.cpp.o
Compiling .pio\build\BIGTREE_SKR_PRO\FrameworkArduino\WInterrupts.cpp.o
Compiling .pio\build\BIGTREE_SKR_PRO\FrameworkArduino\WMath.cpp.o
Compiling .pio\build\BIGTREE_SKR_PRO\FrameworkArduino\WSerial.cpp.o
Compiling .pio\build\BIGTREE_SKR_PRO\FrameworkArduino\WString.cpp.o
Compiling .pio\build\BIGTREE_SKR_PRO\FrameworkArduino\abi.cpp.o
Compiling .pio\build\BIGTREE_SKR_PRO\FrameworkArduino\avr\dtostrf.c.o
Compiling .pio\build\BIGTREE_SKR_PRO\FrameworkArduino\board.c.o
Compiling .pio\build\BIGTREE_SKR_PRO\FrameworkArduino\hooks.c.o
Compiling .pio\build\BIGTREE_SKR_PRO\FrameworkArduino\itoa.c.o
Compiling .pio\build\BIGTREE_SKR_PRO\FrameworkArduino\main.cpp.o
Compiling .pio\build\BIGTREE_SKR_PRO\FrameworkArduino\new.cpp.o
Compiling .pio\build\BIGTREE_SKR_PRO\FrameworkArduino\pins_arduino.c.o
Compiling .pio\build\BIGTREE_SKR_PRO\FrameworkArduino\stm32\HAL\stm32yyxx_hal.c.o
Compiling .pio\build\BIGTREE_SKR_PRO\FrameworkArduino\stm32\HAL\stm32yyxx_hal_adc.c.o
Compiling .pio\build\BIGTREE_SKR_PRO\FrameworkArduino\stm32\HAL\stm32yyxx_hal_adc_ex.c.o
Compiling .pio\build\BIGTREE_SKR_PRO\FrameworkArduino\stm32\HAL\stm32yyxx_hal_can.c.o
Compiling .pio\build\BIGTREE_SKR_PRO\FrameworkArduino\stm32\HAL\stm32yyxx_hal_cec.c.o
Compiling .pio\build\BIGTREE_SKR_PRO\FrameworkArduino\stm32\HAL\stm32yyxx_hal_comp.c.o
Compiling .pio\build\BIGTREE_SKR_PRO\FrameworkArduino\stm32\HAL\stm32yyxx_hal_comp_ex.c.o
Compiling .pio\build\BIGTREE_SKR_PRO\FrameworkArduino\stm32\HAL\stm32yyxx_hal_cordic.c.o
Compiling .pio\build\BIGTREE_SKR_PRO\FrameworkArduino\stm32\HAL\stm32yyxx_hal_cortex.c.o
Compiling .pio\build\BIGTREE_SKR_PRO\FrameworkArduino\stm32\HAL\stm32yyxx_hal_crc.c.o
Compiling .pio\build\BIGTREE_SKR_PRO\FrameworkArduino\stm32\HAL\stm32yyxx_hal_crc_ex.c.o
Compiling .pio\build\BIGTREE_SKR_PRO\FrameworkArduino\stm32\HAL\stm32yyxx_hal_cryp.c.o
Compiling .pio\build\BIGTREE_SKR_PRO\FrameworkArduino\stm32\HAL\stm32yyxx_hal_cryp_ex.c.o
Compiling .pio\build\BIGTREE_SKR_PRO\FrameworkArduino\stm32\HAL\stm32yyxx_hal_dac.c.o
Compiling .pio\build\BIGTREE_SKR_PRO\FrameworkArduino\stm32\HAL\stm32yyxx_hal_dac_ex.c.o
Compiling .pio\build\BIGTREE_SKR_PRO\FrameworkArduino\stm32\HAL\stm32yyxx_hal_dcmi.c.o
Compiling .pio\build\BIGTREE_SKR_PRO\FrameworkArduino\stm32\HAL\stm32yyxx_hal_dcmi_ex.c.o
Compiling .pio\build\BIGTREE_SKR_PRO\FrameworkArduino\stm32\HAL\stm32yyxx_hal_dfsdm.c.o
Compiling .pio\build\BIGTREE_SKR_PRO\FrameworkArduino\stm32\HAL\stm32yyxx_hal_dfsdm_ex.c.o
Compiling .pio\build\BIGTREE_SKR_PRO\FrameworkArduino\stm32\HAL\stm32yyxx_hal_dma.c.o
Compiling .pio\build\BIGTREE_SKR_PRO\FrameworkArduino\stm32\HAL\stm32yyxx_hal_dma2d.c.o
Compiling .pio\build\BIGTREE_SKR_PRO\FrameworkArduino\stm32\HAL\stm32yyxx_hal_dma_ex.c.o
Compiling .pio\build\BIGTREE_SKR_PRO\FrameworkArduino\stm32\HAL\stm32yyxx_hal_dsi.c.o
Compiling .pio\build\BIGTREE_SKR_PRO\FrameworkArduino\stm32\HAL\stm32yyxx_hal_eth.c.o
Compiling .pio\build\BIGTREE_SKR_PRO\FrameworkArduino\stm32\HAL\stm32yyxx_hal_eth_ex.c.o
Compiling .pio\build\BIGTREE_SKR_PRO\FrameworkArduino\stm32\HAL\stm32yyxx_hal_exti.c.o
Compiling .pio\build\BIGTREE_SKR_PRO\FrameworkArduino\stm32\HAL\stm32yyxx_hal_fdcan.c.o
Compiling .pio\build\BIGTREE_SKR_PRO\FrameworkArduino\stm32\HAL\stm32yyxx_hal_firewall.c.o
Compiling .pio\build\BIGTREE_SKR_PRO\FrameworkArduino\stm32\HAL\stm32yyxx_hal_flash.c.o
Compiling .pio\build\BIGTREE_SKR_PRO\FrameworkArduino\stm32\HAL\stm32yyxx_hal_flash_ex.c.o
Compiling .pio\build\BIGTREE_SKR_PRO\FrameworkArduino\stm32\HAL\stm32yyxx_hal_flash_ramfunc.c.o
Compiling .pio\build\BIGTREE_SKR_PRO\FrameworkArduino\stm32\HAL\stm32yyxx_hal_fmac.c.o
Compiling .pio\build\BIGTREE_SKR_PRO\FrameworkArduino\stm32\HAL\stm32yyxx_hal_fmpi2c.c.o
Compiling .pio\build\BIGTREE_SKR_PRO\FrameworkArduino\stm32\HAL\stm32yyxx_hal_fmpi2c_ex.c.o
Compiling .pio\build\BIGTREE_SKR_PRO\FrameworkArduino\stm32\HAL\stm32yyxx_hal_gfxmmu.c.o
Compiling .pio\build\BIGTREE_SKR_PRO\FrameworkArduino\stm32\HAL\stm32yyxx_hal_gpio.c.o
Compiling .pio\build\BIGTREE_SKR_PRO\FrameworkArduino\stm32\HAL\stm32yyxx_hal_gpio_ex.c.o
Compiling .pio\build\BIGTREE_SKR_PRO\FrameworkArduino\stm32\HAL\stm32yyxx_hal_hash.c.o
Compiling .pio\build\BIGTREE_SKR_PRO\FrameworkArduino\stm32\HAL\stm32yyxx_hal_hash_ex.c.o
Compiling .pio\build\BIGTREE_SKR_PRO\FrameworkArduino\stm32\HAL\stm32yyxx_hal_hcd.c.o
Compiling .pio\build\BIGTREE_SKR_PRO\FrameworkArduino\stm32\HAL\stm32yyxx_hal_hrtim.c.o
Compiling .pio\build\BIGTREE_SKR_PRO\FrameworkArduino\stm32\HAL\stm32yyxx_hal_hsem.c.o
Compiling .pio\build\BIGTREE_SKR_PRO\FrameworkArduino\stm32\HAL\stm32yyxx_hal_i2c.c.o
Compiling .pio\build\BIGTREE_SKR_PRO\FrameworkArduino\stm32\HAL\stm32yyxx_hal_i2c_ex.c.o
Compiling .pio\build\BIGTREE_SKR_PRO\FrameworkArduino\stm32\HAL\stm32yyxx_hal_i2s.c.o
Compiling .pio\build\BIGTREE_SKR_PRO\FrameworkArduino\stm32\HAL\stm32yyxx_hal_i2s_ex.c.o
Compiling .pio\build\BIGTREE_SKR_PRO\FrameworkArduino\stm32\HAL\stm32yyxx_hal_ipcc.c.o
Compiling .pio\build\BIGTREE_SKR_PRO\FrameworkArduino\stm32\HAL\stm32yyxx_hal_irda.c.o
Compiling .pio\build\BIGTREE_SKR_PRO\FrameworkArduino\stm32\HAL\stm32yyxx_hal_iwdg.c.o
Compiling .pio\build\BIGTREE_SKR_PRO\FrameworkArduino\stm32\HAL\stm32yyxx_hal_jpeg.c.o
Compiling .pio\build\BIGTREE_SKR_PRO\FrameworkArduino\stm32\HAL\stm32yyxx_hal_lcd.c.o
Compiling .pio\build\BIGTREE_SKR_PRO\FrameworkArduino\stm32\HAL\stm32yyxx_hal_lptim.c.o
Compiling .pio\build\BIGTREE_SKR_PRO\FrameworkArduino\stm32\HAL\stm32yyxx_hal_ltdc.c.o
Compiling .pio\build\BIGTREE_SKR_PRO\FrameworkArduino\stm32\HAL\stm32yyxx_hal_ltdc_ex.c.o
Compiling .pio\build\BIGTREE_SKR_PRO\FrameworkArduino\stm32\HAL\stm32yyxx_hal_mdios.c.o
Compiling .pio\build\BIGTREE_SKR_PRO\FrameworkArduino\stm32\HAL\stm32yyxx_hal_mdma.c.o
Compiling .pio\build\BIGTREE_SKR_PRO\FrameworkArduino\stm32\HAL\stm32yyxx_hal_mmc.c.o
Compiling .pio\build\BIGTREE_SKR_PRO\FrameworkArduino\stm32\HAL\stm32yyxx_hal_mmc_ex.c.o
Compiling .pio\build\BIGTREE_SKR_PRO\FrameworkArduino\stm32\HAL\stm32yyxx_hal_msp_template.c.o
Compiling .pio\build\BIGTREE_SKR_PRO\FrameworkArduino\stm32\HAL\stm32yyxx_hal_nand.c.o
Compiling .pio\build\BIGTREE_SKR_PRO\FrameworkArduino\stm32\HAL\stm32yyxx_hal_nor.c.o
Compiling .pio\build\BIGTREE_SKR_PRO\FrameworkArduino\stm32\HAL\stm32yyxx_hal_opamp.c.o
Compiling .pio\build\BIGTREE_SKR_PRO\FrameworkArduino\stm32\HAL\stm32yyxx_hal_opamp_ex.c.o
Compiling .pio\build\BIGTREE_SKR_PRO\FrameworkArduino\stm32\HAL\stm32yyxx_hal_ospi.c.o
Compiling .pio\build\BIGTREE_SKR_PRO\FrameworkArduino\stm32\HAL\stm32yyxx_hal_pccard.c.o
Compiling .pio\build\BIGTREE_SKR_PRO\FrameworkArduino\stm32\HAL\stm32yyxx_hal_pcd.c.o
Compiling .pio\build\BIGTREE_SKR_PRO\FrameworkArduino\stm32\HAL\stm32yyxx_hal_pcd_ex.c.o
Compiling .pio\build\BIGTREE_SKR_PRO\FrameworkArduino\stm32\HAL\stm32yyxx_hal_pka.c.o
Compiling .pio\build\BIGTREE_SKR_PRO\FrameworkArduino\stm32\HAL\stm32yyxx_hal_pwr.c.o
Compiling .pio\build\BIGTREE_SKR_PRO\FrameworkArduino\stm32\HAL\stm32yyxx_hal_pwr_ex.c.o
Compiling .pio\build\BIGTREE_SKR_PRO\FrameworkArduino\stm32\HAL\stm32yyxx_hal_qspi.c.o
Compiling .pio\build\BIGTREE_SKR_PRO\FrameworkArduino\stm32\HAL\stm32yyxx_hal_ramecc.c.o
Compiling .pio\build\BIGTREE_SKR_PRO\FrameworkArduino\stm32\HAL\stm32yyxx_hal_rcc.c.o
Compiling .pio\build\BIGTREE_SKR_PRO\FrameworkArduino\stm32\HAL\stm32yyxx_hal_rcc_ex.c.o
Compiling .pio\build\BIGTREE_SKR_PRO\FrameworkArduino\stm32\HAL\stm32yyxx_hal_rng.c.o
Compiling .pio\build\BIGTREE_SKR_PRO\FrameworkArduino\stm32\HAL\stm32yyxx_hal_rtc.c.o
Compiling .pio\build\BIGTREE_SKR_PRO\FrameworkArduino\stm32\HAL\stm32yyxx_hal_rtc_ex.c.o
Compiling .pio\build\BIGTREE_SKR_PRO\FrameworkArduino\stm32\HAL\stm32yyxx_hal_sai.c.o
Compiling .pio\build\BIGTREE_SKR_PRO\FrameworkArduino\stm32\HAL\stm32yyxx_hal_sai_ex.c.o
Compiling .pio\build\BIGTREE_SKR_PRO\FrameworkArduino\stm32\HAL\stm32yyxx_hal_sd.c.o
Compiling .pio\build\BIGTREE_SKR_PRO\FrameworkArduino\stm32\HAL\stm32yyxx_hal_sd_ex.c.o
Compiling .pio\build\BIGTREE_SKR_PRO\FrameworkArduino\stm32\HAL\stm32yyxx_hal_sdadc.c.o
Compiling .pio\build\BIGTREE_SKR_PRO\FrameworkArduino\stm32\HAL\stm32yyxx_hal_sdram.c.o
Compiling .pio\build\BIGTREE_SKR_PRO\FrameworkArduino\stm32\HAL\stm32yyxx_hal_smartcard.c.o
Compiling .pio\build\BIGTREE_SKR_PRO\FrameworkArduino\stm32\HAL\stm32yyxx_hal_smartcard_ex.c.o
Compiling .pio\build\BIGTREE_SKR_PRO\FrameworkArduino\stm32\HAL\stm32yyxx_hal_smbus.c.o
Compiling .pio\build\BIGTREE_SKR_PRO\FrameworkArduino\stm32\HAL\stm32yyxx_hal_spdifrx.c.o
Compiling .pio\build\BIGTREE_SKR_PRO\FrameworkArduino\stm32\HAL\stm32yyxx_hal_spi.c.o
Compiling .pio\build\BIGTREE_SKR_PRO\FrameworkArduino\stm32\HAL\stm32yyxx_hal_spi_ex.c.o
Compiling .pio\build\BIGTREE_SKR_PRO\FrameworkArduino\stm32\HAL\stm32yyxx_hal_sram.c.o
Compiling .pio\build\BIGTREE_SKR_PRO\FrameworkArduino\stm32\HAL\stm32yyxx_hal_swpmi.c.o
Compiling .pio\build\BIGTREE_SKR_PRO\FrameworkArduino\stm32\HAL\stm32yyxx_hal_tim.c.o
Compiling .pio\build\BIGTREE_SKR_PRO\FrameworkArduino\stm32\HAL\stm32yyxx_hal_tim_ex.c.o
Compiling .pio\build\BIGTREE_SKR_PRO\FrameworkArduino\stm32\HAL\stm32yyxx_hal_timebase_rtc_alarm_template.c.o
Compiling .pio\build\BIGTREE_SKR_PRO\FrameworkArduino\stm32\HAL\stm32yyxx_hal_timebase_rtc_wakeup_template.c.o
Compiling .pio\build\BIGTREE_SKR_PRO\FrameworkArduino\stm32\HAL\stm32yyxx_hal_timebase_tim_template.c.o
Compiling .pio\build\BIGTREE_SKR_PRO\FrameworkArduino\stm32\HAL\stm32yyxx_hal_tsc.c.o
Compiling .pio\build\BIGTREE_SKR_PRO\FrameworkArduino\stm32\HAL\stm32yyxx_hal_uart.c.o
Compiling .pio\build\BIGTREE_SKR_PRO\FrameworkArduino\stm32\HAL\stm32yyxx_hal_uart_ex.c.o
Compiling .pio\build\BIGTREE_SKR_PRO\FrameworkArduino\stm32\HAL\stm32yyxx_hal_usart.c.o
Compiling .pio\build\BIGTREE_SKR_PRO\FrameworkArduino\stm32\HAL\stm32yyxx_hal_usart_ex.c.o
Compiling .pio\build\BIGTREE_SKR_PRO\FrameworkArduino\stm32\HAL\stm32yyxx_hal_wwdg.c.o
Compiling .pio\build\BIGTREE_SKR_PRO\FrameworkArduino\stm32\LL\stm32yyxx_ll_adc.c.o
Compiling .pio\build\BIGTREE_SKR_PRO\FrameworkArduino\stm32\LL\stm32yyxx_ll_bdma.c.o
Compiling .pio\build\BIGTREE_SKR_PRO\FrameworkArduino\stm32\LL\stm32yyxx_ll_comp.c.o
Compiling .pio\build\BIGTREE_SKR_PRO\FrameworkArduino\stm32\LL\stm32yyxx_ll_cordic.c.o
Compiling .pio\build\BIGTREE_SKR_PRO\FrameworkArduino\stm32\LL\stm32yyxx_ll_crc.c.o
Compiling .pio\build\BIGTREE_SKR_PRO\FrameworkArduino\stm32\LL\stm32yyxx_ll_crs.c.o
Compiling .pio\build\BIGTREE_SKR_PRO\FrameworkArduino\stm32\LL\stm32yyxx_ll_dac.c.o
Compiling .pio\build\BIGTREE_SKR_PRO\FrameworkArduino\stm32\LL\stm32yyxx_ll_delayblock.c.o
Compiling .pio\build\BIGTREE_SKR_PRO\FrameworkArduino\stm32\LL\stm32yyxx_ll_dma.c.o
Compiling .pio\build\BIGTREE_SKR_PRO\FrameworkArduino\stm32\LL\stm32yyxx_ll_dma2d.c.o
Compiling .pio\build\BIGTREE_SKR_PRO\FrameworkArduino\stm32\LL\stm32yyxx_ll_exti.c.o
Compiling .pio\build\BIGTREE_SKR_PRO\FrameworkArduino\stm32\LL\stm32yyxx_ll_fmac.c.o
Compiling .pio\build\BIGTREE_SKR_PRO\FrameworkArduino\stm32\LL\stm32yyxx_ll_fmc.c.o
Compiling .pio\build\BIGTREE_SKR_PRO\FrameworkArduino\stm32\LL\stm32yyxx_ll_fsmc.c.o
Compiling .pio\build\BIGTREE_SKR_PRO\FrameworkArduino\stm32\LL\stm32yyxx_ll_gpio.c.o
Compiling .pio\build\BIGTREE_SKR_PRO\FrameworkArduino\stm32\LL\stm32yyxx_ll_hrtim.c.o
Compiling .pio\build\BIGTREE_SKR_PRO\FrameworkArduino\stm32\LL\stm32yyxx_ll_i2c.c.o
Compiling .pio\build\BIGTREE_SKR_PRO\FrameworkArduino\stm32\LL\stm32yyxx_ll_lptim.c.o
Compiling .pio\build\BIGTREE_SKR_PRO\FrameworkArduino\stm32\LL\stm32yyxx_ll_lpuart.c.o
Compiling .pio\build\BIGTREE_SKR_PRO\FrameworkArduino\stm32\LL\stm32yyxx_ll_mdma.c.o
Compiling .pio\build\BIGTREE_SKR_PRO\FrameworkArduino\stm32\LL\stm32yyxx_ll_opamp.c.o
Compiling .pio\build\BIGTREE_SKR_PRO\FrameworkArduino\stm32\LL\stm32yyxx_ll_pka.c.o
Compiling .pio\build\BIGTREE_SKR_PRO\FrameworkArduino\stm32\LL\stm32yyxx_ll_pwr.c.o
Compiling .pio\build\BIGTREE_SKR_PRO\FrameworkArduino\stm32\LL\stm32yyxx_ll_rcc.c.o
Compiling .pio\build\BIGTREE_SKR_PRO\FrameworkArduino\stm32\LL\stm32yyxx_ll_rng.c.o
Compiling .pio\build\BIGTREE_SKR_PRO\FrameworkArduino\stm32\LL\stm32yyxx_ll_rtc.c.o
Compiling .pio\build\BIGTREE_SKR_PRO\FrameworkArduino\stm32\LL\stm32yyxx_ll_sdmmc.c.o
Compiling .pio\build\BIGTREE_SKR_PRO\FrameworkArduino\stm32\LL\stm32yyxx_ll_spi.c.o
Compiling .pio\build\BIGTREE_SKR_PRO\FrameworkArduino\stm32\LL\stm32yyxx_ll_swpmi.c.o
Compiling .pio\build\BIGTREE_SKR_PRO\FrameworkArduino\stm32\LL\stm32yyxx_ll_tim.c.o
Compiling .pio\build\BIGTREE_SKR_PRO\FrameworkArduino\stm32\LL\stm32yyxx_ll_ucpd.c.o
Compiling .pio\build\BIGTREE_SKR_PRO\FrameworkArduino\stm32\LL\stm32yyxx_ll_usart.c.o
Compiling .pio\build\BIGTREE_SKR_PRO\FrameworkArduino\stm32\LL\stm32yyxx_ll_usb.c.o
Compiling .pio\build\BIGTREE_SKR_PRO\FrameworkArduino\stm32\LL\stm32yyxx_ll_utils.c.o
Compiling .pio\build\BIGTREE_SKR_PRO\FrameworkArduino\stm32\PortNames.c.o
Compiling .pio\build\BIGTREE_SKR_PRO\FrameworkArduino\stm32\analog.cpp.o
Compiling .pio\build\BIGTREE_SKR_PRO\FrameworkArduino\stm32\bootloader.c.o
Compiling .pio\build\BIGTREE_SKR_PRO\FrameworkArduino\stm32\clock.c.o
Compiling .pio\build\BIGTREE_SKR_PRO\FrameworkArduino\stm32\core_callback.c.o
Compiling .pio\build\BIGTREE_SKR_PRO\FrameworkArduino\stm32\dwt.c.o
Compiling .pio\build\BIGTREE_SKR_PRO\FrameworkArduino\stm32\hw_config.c.o
Compiling .pio\build\BIGTREE_SKR_PRO\FrameworkArduino\stm32\interrupt.cpp.o
Compiling .pio\build\BIGTREE_SKR_PRO\FrameworkArduino\stm32\low_power.c.o
Compiling .pio\build\BIGTREE_SKR_PRO\FrameworkArduino\stm32\pinmap.c.o
Compiling .pio\build\BIGTREE_SKR_PRO\FrameworkArduino\stm32\rtc.c.o
Compiling .pio\build\BIGTREE_SKR_PRO\FrameworkArduino\stm32\spi_com.c.o
Compiling .pio\build\BIGTREE_SKR_PRO\FrameworkArduino\stm32\startup_stm32yyxx.S.o
Compiling .pio\build\BIGTREE_SKR_PRO\FrameworkArduino\stm32\stm32_def.c.o
Compiling .pio\build\BIGTREE_SKR_PRO\FrameworkArduino\stm32\stm32_eeprom.c.o
Compiling .pio\build\BIGTREE_SKR_PRO\FrameworkArduino\stm32\system_stm32yyxx.c.o
Compiling .pio\build\BIGTREE_SKR_PRO\FrameworkArduino\stm32\timer.c.o
Compiling .pio\build\BIGTREE_SKR_PRO\FrameworkArduino\stm32\twi.c.o
Compiling .pio\build\BIGTREE_SKR_PRO\FrameworkArduino\stm32\uart.c.o
Compiling .pio\build\BIGTREE_SKR_PRO\FrameworkArduino\stm32\usb\cdc\cdc_queue.c.o
Compiling .pio\build\BIGTREE_SKR_PRO\FrameworkArduino\stm32\usb\cdc\usbd_cdc.c.o
Compiling .pio\build\BIGTREE_SKR_PRO\FrameworkArduino\stm32\usb\cdc\usbd_cdc_if.c.o
Compiling .pio\build\BIGTREE_SKR_PRO\FrameworkArduino\stm32\usb\hid\usbd_hid_composite.c.o
Compiling .pio\build\BIGTREE_SKR_PRO\FrameworkArduino\stm32\usb\hid\usbd_hid_composite_if.c.o
Compiling .pio\build\BIGTREE_SKR_PRO\FrameworkArduino\stm32\usb\usb_device_core.c.o
Compiling .pio\build\BIGTREE_SKR_PRO\FrameworkArduino\stm32\usb\usb_device_ctlreq.c.o
Compiling .pio\build\BIGTREE_SKR_PRO\FrameworkArduino\stm32\usb\usb_device_ioreq.c.o
Compiling .pio\build\BIGTREE_SKR_PRO\FrameworkArduino\stm32\usb\usbd_conf.c.o
Compiling .pio\build\BIGTREE_SKR_PRO\FrameworkArduino\stm32\usb\usbd_desc.c.o
Compiling .pio\build\BIGTREE_SKR_PRO\FrameworkArduino\stm32\usb\usbd_ep_conf.c.o
Compiling .pio\build\BIGTREE_SKR_PRO\FrameworkArduino\stm32\usb\usbd_if.c.o
Compiling .pio\build\BIGTREE_SKR_PRO\FrameworkArduino\syscalls.c.o
Compiling .pio\build\BIGTREE_SKR_PRO\FrameworkArduino\wiring_analog.c.o
Compiling .pio\build\BIGTREE_SKR_PRO\FrameworkArduino\wiring_digital.c.o
Compiling .pio\build\BIGTREE_SKR_PRO\FrameworkArduino\wiring_pulse.cpp.o
Compiling .pio\build\BIGTREE_SKR_PRO\FrameworkArduino\wiring_shift.c.o
Compiling .pio\build\BIGTREE_SKR_PRO\FrameworkArduino\wiring_time.c.o
Compiling .pio\build\BIGTREE_SKR_PRO\src\src\HAL\STM32\HAL.cpp.o
Compiling .pio\build\BIGTREE_SKR_PRO\src\src\HAL\STM32\HAL_SPI.cpp.o
Compiling .pio\build\BIGTREE_SKR_PRO\src\src\HAL\STM32\MarlinSerial.cpp.o
Compiling .pio\build\BIGTREE_SKR_PRO\src\src\HAL\STM32\Sd2Card_sdio_stm32duino.cpp.o
Compiling .pio\build\BIGTREE_SKR_PRO\src\src\HAL\STM32\Servo.cpp.o
Compiling .pio\build\BIGTREE_SKR_PRO\src\src\HAL\STM32\SoftwareSerial.cpp.o
Compiling .pio\build\BIGTREE_SKR_PRO\src\src\HAL\STM32\eeprom_flash.cpp.o
Compiling .pio\build\BIGTREE_SKR_PRO\src\src\HAL\STM32\eeprom_sdcard.cpp.o
In file included from c:\marlin\marlin\src\inc\marlinconfig.h:32,
                 from Marlin\src\HAL\STM32\HAL_SPI.cpp:25:
c:\marlin\marlin\src\pins\pins.h:689:6: error: #error "BOARD_BIGTREE_SKR_PRO_V1_1 has been renamed BOARD_BTT_SKR_PRO_V1_1. Please update your configuration."
  689 |     #error "BOARD_BIGTREE_SKR_PRO_V1_1 has been renamed BOARD_BTT_SKR_PRO_V1_1. Please update your configuration."
      |      ^~~~~
In file included from c:\marlin\marlin\src\inc\marlinconfig.h:41,
                 from Marlin\src\HAL\STM32\HAL_SPI.cpp:25:
c:\marlin\marlin\src\inc\SanityCheck.h:1790:4: error: #error "HEATER_0_PIN not defined for this board."
 1790 |   #error "HEATER_0_PIN not defined for this board."
      |    ^~~~~
c:\marlin\marlin\src\inc\SanityCheck.h:1805:4: error: #error "TEMP_0_PIN (required for TEMP_SENSOR_0) not defined for this board."
 1805 |   #error "TEMP_0_PIN (required for TEMP_SENSOR_0) not defined for this board."
      |    ^~~~~
c:\marlin\marlin\src\inc\SanityCheck.h:1854:8: error: #error "E0_STEP_PIN, E0_DIR_PIN, or E0_ENABLE_PIN not defined for this board."
 1854 |       #error "E0_STEP_PIN, E0_DIR_PIN, or E0_ENABLE_PIN not defined for this board."
      |        ^~~~~
In file included from c:\marlin\marlin\src\inc\marlinconfig.h:32,
                 from Marlin\src\HAL\STM32\HAL.cpp:28:
c:\marlin\marlin\src\pins\pins.h:689:6: error: #error "BOARD_BIGTREE_SKR_PRO_V1_1 has been renamed BOARD_BTT_SKR_PRO_V1_1. Please update your configuration."
  689 |     #error "BOARD_BIGTREE_SKR_PRO_V1_1 has been renamed BOARD_BTT_SKR_PRO_V1_1. Please update your configuration."
      |      ^~~~~
In file included from c:\marlin\marlin\src\inc\marlinconfig.h:32,
                 from Marlin\src\HAL\STM32\MarlinSerial.cpp:22:
c:\marlin\marlin\src\pins\pins.h:689:6: error: #error "BOARD_BIGTREE_SKR_PRO_V1_1 has been renamed BOARD_BTT_SKR_PRO_V1_1. Please update your configuration."
  689 |     #error "BOARD_BIGTREE_SKR_PRO_V1_1 has been renamed BOARD_BTT_SKR_PRO_V1_1. Please update your configuration."
      |      ^~~~~
In file included from c:\marlin\marlin\src\inc\marlinconfig.h:41,
                 from Marlin\src\HAL\STM32\HAL.cpp:28:
c:\marlin\marlin\src\inc\SanityCheck.h:1790:4: error: #error "HEATER_0_PIN not defined for this board."
 1790 |   #error "HEATER_0_PIN not defined for this board."
      |    ^~~~~
c:\marlin\marlin\src\inc\SanityCheck.h:1805:4: error: #error "TEMP_0_PIN (required for TEMP_SENSOR_0) not defined for this board."
 1805 |   #error "TEMP_0_PIN (required for TEMP_SENSOR_0) not defined for this board."
      |    ^~~~~
c:\marlin\marlin\src\inc\SanityCheck.h:1854:8: error: #error "E0_STEP_PIN, E0_DIR_PIN, or E0_ENABLE_PIN not defined for this board."
 1854 |       #error "E0_STEP_PIN, E0_DIR_PIN, or E0_ENABLE_PIN not defined for this board."
      |        ^~~~~
In file included from c:\marlin\marlin\src\inc\marlinconfig.h:41,
                 from Marlin\src\HAL\STM32\MarlinSerial.cpp:22:
c:\marlin\marlin\src\inc\SanityCheck.h:1790:4: error: #error "HEATER_0_PIN not defined for this board."
 1790 |   #error "HEATER_0_PIN not defined for this board."
      |    ^~~~~
c:\marlin\marlin\src\inc\SanityCheck.h:1805:4: error: #error "TEMP_0_PIN (required for TEMP_SENSOR_0) not defined for this board."
 1805 |   #error "TEMP_0_PIN (required for TEMP_SENSOR_0) not defined for this board."
      |    ^~~~~
c:\marlin\marlin\src\inc\SanityCheck.h:1854:8: error: #error "E0_STEP_PIN, E0_DIR_PIN, or E0_ENABLE_PIN not defined for this board."
 1854 |       #error "E0_STEP_PIN, E0_DIR_PIN, or E0_ENABLE_PIN not defined for this board."
      |        ^~~~~
In file included from c:\marlin\marlin\src\inc\marlinconfig.h:32,
                 from Marlin\src\HAL\STM32\Sd2Card_sdio_stm32duino.cpp:23:
c:\marlin\marlin\src\pins\pins.h:689:6: error: #error "BOARD_BIGTREE_SKR_PRO_V1_1 has been renamed BOARD_BTT_SKR_PRO_V1_1. Please update your configuration."
  689 |     #error "BOARD_BIGTREE_SKR_PRO_V1_1 has been renamed BOARD_BTT_SKR_PRO_V1_1. Please update your configuration."
      |      ^~~~~
In file included from c:\marlin\marlin\src\inc\marlinconfig.h:32,
                 from Marlin\src\HAL\STM32\Servo.cpp:25:
c:\marlin\marlin\src\pins\pins.h:689:6: error: #error "BOARD_BIGTREE_SKR_PRO_V1_1 has been renamed BOARD_BTT_SKR_PRO_V1_1. Please update your configuration."
  689 |     #error "BOARD_BIGTREE_SKR_PRO_V1_1 has been renamed BOARD_BTT_SKR_PRO_V1_1. Please update your configuration."
      |      ^~~~~
In file included from c:\marlin\marlin\src\inc\marlinconfig.h:32,
                 from Marlin\src\HAL\STM32\SoftwareSerial.cpp:39:
c:\marlin\marlin\src\pins\pins.h:689:6: error: #error "BOARD_BIGTREE_SKR_PRO_V1_1 has been renamed BOARD_BTT_SKR_PRO_V1_1. Please update your configuration."
  689 |     #error "BOARD_BIGTREE_SKR_PRO_V1_1 has been renamed BOARD_BTT_SKR_PRO_V1_1. Please update your configuration."
      |      ^~~~~
In file included from c:\marlin\marlin\src\inc\marlinconfig.h:41,
                 from Marlin\src\HAL\STM32\Sd2Card_sdio_stm32duino.cpp:23:
c:\marlin\marlin\src\inc\SanityCheck.h:1790:4: error: #error "HEATER_0_PIN not defined for this board."
 1790 |   #error "HEATER_0_PIN not defined for this board."
      |    ^~~~~
c:\marlin\marlin\src\inc\SanityCheck.h:1805:4: error: #error "TEMP_0_PIN (required for TEMP_SENSOR_0) not defined for this board."
 1805 |   #error "TEMP_0_PIN (required for TEMP_SENSOR_0) not defined for this board."
      |    ^~~~~
c:\marlin\marlin\src\inc\SanityCheck.h:1854:8: error: #error "E0_STEP_PIN, E0_DIR_PIN, or E0_ENABLE_PIN not defined for this board."
 1854 |       #error "E0_STEP_PIN, E0_DIR_PIN, or E0_ENABLE_PIN not defined for this board."
      |        ^~~~~
In file included from c:\marlin\marlin\src\inc\marlinconfig.h:32,
                 from Marlin\src\HAL\STM32\eeprom_flash.cpp:25:
c:\marlin\marlin\src\pins\pins.h:689:6: error: #error "BOARD_BIGTREE_SKR_PRO_V1_1 has been renamed BOARD_BTT_SKR_PRO_V1_1. Please update your configuration."
  689 |     #error "BOARD_BIGTREE_SKR_PRO_V1_1 has been renamed BOARD_BTT_SKR_PRO_V1_1. Please update your configuration."
      |      ^~~~~
In file included from c:\marlin\marlin\src\inc\marlinconfig.h:41,
                 from Marlin\src\HAL\STM32\SoftwareSerial.cpp:39:
c:\marlin\marlin\src\inc\SanityCheck.h:1790:4: error: #error "HEATER_0_PIN not defined for this board."
 1790 |   #error "HEATER_0_PIN not defined for this board."
      |    ^~~~~
c:\marlin\marlin\src\inc\SanityCheck.h:1805:4: error: #error "TEMP_0_PIN (required for TEMP_SENSOR_0) not defined for this board."
 1805 |   #error "TEMP_0_PIN (required for TEMP_SENSOR_0) not defined for this board."
      |    ^~~~~
c:\marlin\marlin\src\inc\SanityCheck.h:1854:8: error: #error "E0_STEP_PIN, E0_DIR_PIN, or E0_ENABLE_PIN not defined for this board."
 1854 |       #error "E0_STEP_PIN, E0_DIR_PIN, or E0_ENABLE_PIN not defined for this board."
      |        ^~~~~
In file included from c:\marlin\marlin\src\inc\marlinconfig.h:41,
                 from Marlin\src\HAL\STM32\Servo.cpp:25:
c:\marlin\marlin\src\inc\SanityCheck.h:1790:4: error: #error "HEATER_0_PIN not defined for this board."
 1790 |   #error "HEATER_0_PIN not defined for this board."
      |    ^~~~~
c:\marlin\marlin\src\inc\SanityCheck.h:1805:4: error: #error "TEMP_0_PIN (required for TEMP_SENSOR_0) not defined for this board."
 1805 |   #error "TEMP_0_PIN (required for TEMP_SENSOR_0) not defined for this board."
      |    ^~~~~
c:\marlin\marlin\src\inc\SanityCheck.h:1854:8: error: #error "E0_STEP_PIN, E0_DIR_PIN, or E0_ENABLE_PIN not defined for this board."
 1854 |       #error "E0_STEP_PIN, E0_DIR_PIN, or E0_ENABLE_PIN not defined for this board."
      |        ^~~~~
In file included from c:\marlin\marlin\src\inc\marlinconfig.h:41,
                 from Marlin\src\HAL\STM32\eeprom_flash.cpp:25:
c:\marlin\marlin\src\inc\SanityCheck.h:1790:4: error: #error "HEATER_0_PIN not defined for this board."
 1790 |   #error "HEATER_0_PIN not defined for this board."
      |    ^~~~~
c:\marlin\marlin\src\inc\SanityCheck.h:1805:4: error: #error "TEMP_0_PIN (required for TEMP_SENSOR_0) not defined for this board."
 1805 |   #error "TEMP_0_PIN (required for TEMP_SENSOR_0) not defined for this board."
      |    ^~~~~
c:\marlin\marlin\src\inc\SanityCheck.h:1854:8: error: #error "E0_STEP_PIN, E0_DIR_PIN, or E0_ENABLE_PIN not defined for this board."
 1854 |       #error "E0_STEP_PIN, E0_DIR_PIN, or E0_ENABLE_PIN not defined for this board."
      |        ^~~~~
*** [.pio\build\BIGTREE_SKR_PRO\src\src\HAL\STM32\HAL_SPI.cpp.o] Error 1
In file included from c:\marlin\marlin\src\inc\marlinconfig.h:32,
                 from Marlin\src\HAL\STM32\eeprom_sdcard.cpp:29:
c:\marlin\marlin\src\pins\pins.h:689:6: error: #error "BOARD_BIGTREE_SKR_PRO_V1_1 has been renamed BOARD_BTT_SKR_PRO_V1_1. Please update your configuration."
  689 |     #error "BOARD_BIGTREE_SKR_PRO_V1_1 has been renamed BOARD_BTT_SKR_PRO_V1_1. Please update your configuration."
      |      ^~~~~
*** [.pio\build\BIGTREE_SKR_PRO\src\src\HAL\STM32\HAL.cpp.o] Error 1
In file included from c:\marlin\marlin\src\inc\marlinconfig.h:41,
                 from Marlin\src\HAL\STM32\eeprom_sdcard.cpp:29:
c:\marlin\marlin\src\inc\SanityCheck.h:1790:4: error: #error "HEATER_0_PIN not defined for this board."
 1790 |   #error "HEATER_0_PIN not defined for this board."
      |    ^~~~~
c:\marlin\marlin\src\inc\SanityCheck.h:1805:4: error: #error "TEMP_0_PIN (required for TEMP_SENSOR_0) not defined for this board."
 1805 |   #error "TEMP_0_PIN (required for TEMP_SENSOR_0) not defined for this board."
      |    ^~~~~
c:\marlin\marlin\src\inc\SanityCheck.h:1854:8: error: #error "E0_STEP_PIN, E0_DIR_PIN, or E0_ENABLE_PIN not defined for this board."
 1854 |       #error "E0_STEP_PIN, E0_DIR_PIN, or E0_ENABLE_PIN not defined for this board."
      |        ^~~~~
*** [.pio\build\BIGTREE_SKR_PRO\src\src\HAL\STM32\MarlinSerial.cpp.o] Error 1
*** [.pio\build\BIGTREE_SKR_PRO\src\src\HAL\STM32\Servo.cpp.o] Error 1
*** [.pio\build\BIGTREE_SKR_PRO\src\src\HAL\STM32\SoftwareSerial.cpp.o] Error 1
*** [.pio\build\BIGTREE_SKR_PRO\src\src\HAL\STM32\Sd2Card_sdio_stm32duino.cpp.o] Error 1
*** [.pio\build\BIGTREE_SKR_PRO\src\src\HAL\STM32\eeprom_flash.cpp.o] Error 1
*** [.pio\build\BIGTREE_SKR_PRO\src\src\HAL\STM32\eeprom_sdcard.cpp.o] Error 1
================================================================================================== [FAILED] Took 26.26 seconds ==================================================================================================

Environment               Status    Duration
------------------------  --------  ------------
mega2560                  IGNORED
mega1280                  IGNORED
MightyBoard1280           IGNORED
MightyBoard2560           IGNORED
rambo                     IGNORED
FYSETC_F6_13              IGNORED
FYSETC_F6_14              IGNORED
sanguino644p              IGNORED
sanguino1284p             IGNORED
melzi                     IGNORED
melzi_optiboot            IGNORED
melzi_optimized           IGNORED
at90usb1286_cdc           IGNORED
at90usb1286_dfu           IGNORED
DUE                       IGNORED
DUE_USB                   IGNORED
DUE_debug                 IGNORED
DUE_archim                IGNORED
DUE_archim_debug          IGNORED
SAMD51_grandcentral_m4    IGNORED
LPC1768                   IGNORED
LPC1769                   IGNORED
STM32F103RC               IGNORED
STM32F103RC_meeb          IGNORED
STM32F103RC_fysetc        IGNORED
STM32F103RC_btt           IGNORED
STM32F103RC_btt_USB       IGNORED
STM32F103RC_btt_512K      IGNORED
STM32F103RC_btt_512K_USB  IGNORED
STM32F103RE               IGNORED
STM32F103RE_btt           IGNORED
STM32F103RE_btt_USB       IGNORED
STM32F4                   IGNORED
STM32F7                   IGNORED
ARMED                     IGNORED
STM32F103VE_GTM32         IGNORED
STM32F103VE_longer        IGNORED
mks_robin_mini            IGNORED
mks_robin_nano            IGNORED
mks_robin_nano35          IGNORED
mks_robin                 IGNORED
mks_robin_pro             IGNORED
mks_robin_e3              IGNORED
mks_robin_lite            IGNORED
mks_robin_lite3           IGNORED
jgaurora_a5s_a1           IGNORED
STM32F103CB_malyan        IGNORED
STM32F070RB_malyan        IGNORED
malyan_M300               IGNORED
chitu_f103                IGNORED
chitu_v5_gpio_init        IGNORED
chitu_f103_lvgl           IGNORED
STM32F103RET6_creality    IGNORED
STM32F401VE_STEVAL        IGNORED
FLYF407ZG                 IGNORED
FYSETC_S6                 IGNORED
STM32F407VE_black         IGNORED
BIGTREE_SKR_PRO           FAILED    00:00:26.256
BIGTREE_GTR_V1_0          IGNORED
BIGTREE_BTT002            IGNORED
LERDGEX                   IGNORED
LERDGES                   IGNORED
LERDGEK                   IGNORED
rumba32                   IGNORED
esp32                     IGNORED
teensy31                  IGNORED
teensy35                  IGNORED
linux_native              IGNORED
include_tree              IGNORED
============================================================================================= 1 failed, 0 succeeded in 00:00:26.256 =============================================================================================
The terminal process "C:\Users\GRAP CLONE\.platformio\penv\Scripts\platformio.exe 'run', '--environment', 'BIGTREE_SKR_PRO'" terminated with exit code: 1.

Terminal will be reused by tasks, press any key to close it.

 

-------

Edit .. je me repond moi meme

 

 
#define BOARD_RUMBA32_AUS3D 4203 // RUMBA32 STM32F446VET6 based controller from Aus3D
#define BOARD_RUMBA32_MKS 4204 // RUMBA32 STM32F446VET6 based controller from Makerbase
#define BOARD_BLACK_STM32F407VE 4205 // BLACK_STM32F407VE
#define BOARD_BLACK_STM32F407ZE 4206 // BLACK_STM32F407ZE
#define BOARD_STEVAL_3DP001V1 4207 // STEVAL-3DP001V1 3D PRINTER BOARD
#define BOARD_BTT_SKR_PRO_V1_1 4208 // BigTreeTech SKR Pro v1.1 (STM32F407ZG)
#define BOARD_BTT_BTT002_V1_0 4209 // BigTreeTech BTT002 v1.0 (STM32F407VE)

#define BOARD_BTT_GTR_V1_0 4210 // BigTreeTech GTR v1.0 (STM32F407IGT)

 

 

le mode d emploie est erroné ..... et il faut mettre  BOARD_BTT_SKR_PRO_V1_1

c est le test pour savoir lire 😉😉

Modifié (le) par Yo'
Ajout de la balise "code" pour rendre le message plus lisible.
Lien vers le commentaire
Partager sur d’autres sites

Créer un compte ou se connecter pour commenter

Vous devez être membre afin de pouvoir déposer un commentaire

Créer un compte

Créez un compte sur notre communauté. C’est facile !

Créer un nouveau compte

Se connecter

Vous avez déjà un compte ? Connectez-vous ici.

Connectez-vous maintenant
×
×
  • Créer...