Aller au contenu

Filament ABS

[Dev] AlfaWise U20x-U30 : Marlin 2.x (firmware alternatif)


Messages recommandés

Le 1/4/2021 at 12:00 PM, mptc a dit :

Hi. Sorry for writing in English. I updated from version 2.0.5.3 to the latest version in github and now I can't get my SD card to work.

Did anything change from March to this latest version regarding the SD card?

I´ve been playing with SDIO_CLOCK but with no luck. Also tried different cards and re-formatted in FAT32.

Also have to say, thank you very much for all your work on this firmware!

@Epsylon3I figured it out, including #define SDIO_SUPPORT in Configuration.h fixed it, but I can't really say why I need it. 🤔

Lien à poster
Partager sur d’autres sites
  • 5 weeks later...
  • Réponses 3,3k
  • Created
  • Dernière réponse

Top Posters In This Topic

Top Posters In This Topic

Popular Posts

Topic Officiel du portage Marlin 2-x pour Alfawise U20, U20+ et U30     AVERTISSEMENT : Ce Topic est dédié aux aspects techniques du portage de Marlin sur les AlfaWise, développem

Youpi! Bon en tout cas à l analyseur logique il n’y a plus du tout de gros saut. Je suis passé de 100 à 0.  Mais c’est quand même étrange . Je sais que libmaple initialise les timers en mode auto

Les gars qu'est-ce que vous foutez avec le code ?! Non mais franchement... [Un marlin bondit sur un bateau pneumatique et blesse deux hommes] https://www.20minutes.fr/monde/2524603-2019

Posted Images

Hallo my name is Patrick, 

i have an Alfawise U30 with VO8 Board I work with the Tutorial from: 

https://github.com/3d-printing-canada/Longer-LK1-LK2-BL-Touch-Firmware

The 3D Touch Starts but it won´t stop by Auto Home or somethink else. I think the 3d Touch becames no Signal.  

Whats my fault ? I Use the ready compiled Files 

IMG_20210219_002015.jpg

IMG_20210219_001429.jpg

IMG_20210219_001610.jpg

IMG_20210219_001952.jpg

Lien à poster
Partager sur d’autres sites

Z position should be high enough to let the probe fully deploy, if not you will get an error "blinking red led". Then Z is moved down to trigger the probe touch.

Modifié (le) par Epsylon3
Lien à poster
Partager sur d’autres sites
Vor 13 Stunden sagte Epsylon3:

Die Z-Position kann hoch genug sein, damit sich die Sonde befindet sich entfalten kann. Dies wird die Fehlermeldung "Blinkende rote LED". Dann wird Z nach unbewusster Bewegung, um die Sondenberührung auszulösen.

Ja, ich möchte nur zeigen, dass der 3D-Touch-Test beim Start einwandfrei funktioniert. Aber ich kann ihm kein Signal senden. Ich versuche es mit Terminal in OctoPrint und auch auf dem Drucker. Gestern habe ich die neue Marlin Version 2.0.7.2 installiert, aber es hilft nich lockquote-Element Blockquote-Element

Modifié (le) par Draguun
Lien à poster
Partager sur d’autres sites

Bonsoir 

Quelqu'un aurait il une version de firmware pour une alfa 20, avec aio V2 sans BL et sans TM ?

Merci d'avance de votre réponse

Lien à poster
Partager sur d’autres sites

Si il n'y a qu'une AIO V2, il faut juste compiler le code, et regler le PID de la chauffe.... L version standard convien. C'est pas dur a compiler. ...

Lien à poster
Partager sur d’autres sites
  • 1 month later...

Bonjour à tous.

Je demande votre aide car j'ai maintenant un problème que je n'arrive pas à résoudre.

Dans mon U20, j'ai essayé de mettre à niveau Marlin vers 2.0.7.2 en utilisant le cisual code.

Après quelques problèmes, j'ai pu compiler le firmware sans erreurs. Ensuite, je suis allé le flasher dans l'imprimante ... c'est là que les problèmes commencent.

En utilisant le bac compilé avec le fichier longer3d.ui, je ne peux tout simplement pas flasher l'imprimante. J'ai testé le fichier plus long des versions 2.16, 2.14 et 2.17. L'ancien 2, l'imprimante fait le flash screen avec la barre de progression jusqu'à la fin, mais juste après le démarrage de l'ancien firmware.

Avec un fichier longer de 2.17 ne flash même pas. En désespoir de cause, j'ai décidé d'essayer de flasher avec le firmware 2.16 origine et cela a fonctionné et maintenant l'imprimante a le firmware d'origine qui m'est inutile car j'ai bltouch et direct drive extruder.

Pouvez-vous s'il vous plaît m'aider à comprendre ce que je fais de mal pour que le firmware flash pas?

Help! 🙂

marlin_2072.JPG

Modifié (le) par unhuzpt
Lien à poster
Partager sur d’autres sites
Le 24/02/2021 at 18:37, Hobi a dit :

Si il n'y a qu'une AIO V2, il faut juste compiler le code, et regler le PID de la chauffe.... L version standard convien. C'est pas dur a compiler. ...

Bonjour,

personnellement je n'arrive plus a compiler, j'ai testé toutes le versions de platformIO IDE de la 1.6.0 à la 2.3.1.

visiblement a partir de la version 2.0.0 on ne peut plus compiler c'est jusqu’à la version 1.10.0.

Quelqu'un pourrait me donner la version de platformIO + core + home utilisé svp?

Lien à poster
Partager sur d’autres sites

Je n'ai pas remarqué de nouveaux problemes... par contre il faut depuis peu que PlatformIO soit installé par python3, python2 n'est plus compatible depuis PIO 5. Sous linux pour passer de python2 à 3... il faut faire "pip2 uninstall platformio" puis "pip3 install platformio".

Modifié (le) par Epsylon3
Lien à poster
Partager sur d’autres sites
  • 3 weeks later...

Bonjour a tous j'ai un soucis de compilation pour ma U20, voici le details :

 

Processing alfawise_U20 (platform: ststm32; framework: arduino; board: genericSTM32F103VE)
--------------------------------------------------------------------------------------------------------------------------------------------------Tool Manager: Installing platformio/tool-dfuutil @ ~1.9.190708
Tool Manager: tool-dfuutil @ 1.9.200310 has been installed!
Verbose mode can be enabled via `-v, --verbose` option
CONFIGURATION: https://docs.platformio.org/page/boards/ststm32/genericSTM32F103VE.html
PLATFORM: ST STM32 (12.1.1) > STM32F103VE (64k RAM. 512k Flash)
HARDWARE: STM32F103VET6 72MHz, 64KB RAM, 512KB Flash
DEBUG: Current (stlink) External (blackmagic, cmsis-dap, jlink, stlink)
PACKAGES:
 - framework-arduinoststm32 4.10900.200819 (1.9.0)
 - framework-cmsis 2.50501.200527 (5.5.1)
 - tool-dfuutil 1.9.200310
 - tool-openocd 2.1000.200630 (10.0)
 - tool-stm32duino 1.0.2
 - toolchain-gccarmnoneeabi 1.90201.191206 (9.2.1)
Converting Marlin.ino
LDF: Library Dependency Finder -> http://bit.ly/configure-pio-ldf
LDF Modes: Finder ~ chain, Compatibility ~ soft
Library Manager: Installing https://github.com/MarlinFirmware/U8glib-HAL/archive/dev.zip
Library Manager: U8glib-HAL @ 0.4.0 has been installed!
Library Manager: Installing LiquidCrystal @ 1.3.4
Library Manager: Warning! More than one package has been found by LiquidCrystal @ 1.3.4 requirements:
 - bitbucket-fmalpartida/LiquidCrystal @ 1.5.0
 - arduino-libraries/LiquidCrystal @ 1.0.7
Library Manager: Please specify detailed REQUIREMENTS using package owner and version (showed above) to avoid name conflicts
Library Manager: LiquidCrystal @ 1.3.4 has been installed!
Library Manager: Installing TMCStepper @ <1.0.0
Library Manager: TMCStepper @ 0.7.1 has been installed!
Library Manager: Installing Adafruit NeoPixel @ 1.1.3
Library Manager: Warning! More than one package has been found by Adafruit NeoPixel @ 1.1.3 requirements:
 - adafruit/Adafruit NeoPixel @ 1.8.0
 - fkrenn12/Adafruit NeoPixel @ 1.7.0
Library Manager: Please specify detailed REQUIREMENTS using package owner and version (showed above) to avoid name conflicts
Library Manager: Adafruit NeoPixel @ 1.1.3 has been installed!
Library Manager: Installing https://github.com/lincomatic/LiquidTWI2/archive/master.zip
Library Manager: LiquidTWI2 @ 1.2.7 has been installed!
Library Manager: Installing https://github.com/ameyer/Arduino-L6470/archive/dev.zip
Library Manager: Arduino-L6470 @ 0.7.0 has been installed!
Library Manager: Installing https://github.com/trinamic/TMC26XStepper/archive/master.zip
Library Manager: TMC26XStepper @ 0.0.0+20210422125343 has been installed!
Library Manager: Installing https://github.com/mikeshub/SailfishLCD/archive/master.zip
Library Manager: SailfishLCD @ 0.0.0+20210422125343 has been installed!
Library Manager: Installing https://github.com/mikeshub/SailfishRGB_LED/archive/master.zip
Library Manager: SailfishRGB_LED @ 0.0.0+20210422125344 has been installed!
Library Manager: Installing https://github.com/mikeshub/SlowSoftI2CMaster/archive/master.zip
Library Manager: SlowSoftI2CMaster @ 0.0.0+20210422125344 has been installed!
Found 16 compatible libraries
Scanning dependencies...
Dependency Graph
|-- <U8glib-HAL> 0.4.0
|   |-- <Wire> 1.0
|-- <LiquidCrystal> 1.3.4
|   |-- <Wire> 1.0
|-- <TMCStepper> 0.7.1
|   |-- <SoftwareSerial> 1.0
|-- <Arduino-L6470> 0.7.0
|-- <SailfishLCD> 0.0.0+20210422125343
|-- <SailfishRGB_LED> 0.0.0+20210422125344
|   |-- <Wire> 1.0
|-- <SlowSoftI2CMaster> 0.0.0+20210422125344
|-- <EEPROM> 2.0.1
|-- <Wire> 1.0
Building in release mode
Compiling .pio\build\alfawise_U20\FrameworkArduinoVariant\PeripheralPins.c.o
Compiling .pio\build\alfawise_U20\FrameworkArduinoVariant\variant.cpp.o
Compiling .pio\build\alfawise_U20\FrameworkArduino\HardwareSerial.cpp.o
Compiling .pio\build\alfawise_U20\FrameworkArduino\HardwareTimer.cpp.o
Compiling .pio\build\alfawise_U20\FrameworkArduino\IPAddress.cpp.o
Compiling .pio\build\alfawise_U20\FrameworkArduino\Print.cpp.o
Compiling .pio\build\alfawise_U20\FrameworkArduino\RingBuffer.cpp.o
Compiling .pio\build\alfawise_U20\FrameworkArduino\Stream.cpp.o
Compiling .pio\build\alfawise_U20\FrameworkArduino\Tone.cpp.o
Compiling .pio\build\alfawise_U20\FrameworkArduino\USBSerial.cpp.o
Compiling .pio\build\alfawise_U20\FrameworkArduino\VirtIOSerial.cpp.o
Compiling .pio\build\alfawise_U20\FrameworkArduino\WInterrupts.cpp.o
Compiling .pio\build\alfawise_U20\FrameworkArduino\WMath.cpp.o
Compiling .pio\build\alfawise_U20\FrameworkArduino\WSerial.cpp.o
Compiling .pio\build\alfawise_U20\FrameworkArduino\WString.cpp.o
Compiling .pio\build\alfawise_U20\FrameworkArduino\abi.cpp.o
Compiling .pio\build\alfawise_U20\FrameworkArduino\avr\dtostrf.c.o
Compiling .pio\build\alfawise_U20\FrameworkArduino\board.c.o
Compiling .pio\build\alfawise_U20\FrameworkArduino\hooks.c.o
Compiling .pio\build\alfawise_U20\FrameworkArduino\itoa.c.o
Compiling .pio\build\alfawise_U20\FrameworkArduino\main.cpp.o
Compiling .pio\build\alfawise_U20\FrameworkArduino\new.cpp.o
Compiling .pio\build\alfawise_U20\FrameworkArduino\pins_arduino.c.o
Compiling .pio\build\alfawise_U20\FrameworkArduino\stm32\OpenAMP\libmetal\device.c.o
Compiling .pio\build\alfawise_U20\FrameworkArduino\stm32\OpenAMP\libmetal\generic\condition.c.o
Compiling .pio\build\alfawise_U20\FrameworkArduino\stm32\OpenAMP\libmetal\generic\cortexm\sys.c.o
Compiling .pio\build\alfawise_U20\FrameworkArduino\stm32\OpenAMP\libmetal\generic\generic_device.c.o
Compiling .pio\build\alfawise_U20\FrameworkArduino\stm32\OpenAMP\libmetal\generic\generic_init.c.o
Compiling .pio\build\alfawise_U20\FrameworkArduino\stm32\OpenAMP\libmetal\generic\generic_io.c.o
Compiling .pio\build\alfawise_U20\FrameworkArduino\stm32\OpenAMP\libmetal\generic\generic_shmem.c.o
Compiling .pio\build\alfawise_U20\FrameworkArduino\stm32\OpenAMP\libmetal\generic\time.c.o
Compiling .pio\build\alfawise_U20\FrameworkArduino\stm32\OpenAMP\libmetal\init.c.o
Compiling .pio\build\alfawise_U20\FrameworkArduino\stm32\OpenAMP\libmetal\io.c.o
Compiling .pio\build\alfawise_U20\FrameworkArduino\stm32\OpenAMP\libmetal\log.c.o
Compiling .pio\build\alfawise_U20\FrameworkArduino\stm32\OpenAMP\libmetal\shmem.c.o
Compiling .pio\build\alfawise_U20\FrameworkArduino\stm32\OpenAMP\mbox_ipcc.c.o
Compiling .pio\build\alfawise_U20\FrameworkArduino\stm32\OpenAMP\open-amp\remoteproc\remoteproc_virtio.c.o
Compiling .pio\build\alfawise_U20\FrameworkArduino\stm32\OpenAMP\open-amp\rpmsg\rpmsg.c.o
Compiling .pio\build\alfawise_U20\FrameworkArduino\stm32\OpenAMP\open-amp\rpmsg\rpmsg_virtio.c.o
Compiling .pio\build\alfawise_U20\FrameworkArduino\stm32\OpenAMP\openamp.c.o
Compiling .pio\build\alfawise_U20\FrameworkArduino\stm32\OpenAMP\rsc_table.c.o
Compiling .pio\build\alfawise_U20\FrameworkArduino\stm32\OpenAMP\virt_uart.c.o
Compiling .pio\build\alfawise_U20\FrameworkArduino\stm32\OpenAMP\virtio\virtio.c.o
Compiling .pio\build\alfawise_U20\FrameworkArduino\stm32\OpenAMP\virtio\virtqueue.c.o
Compiling .pio\build\alfawise_U20\FrameworkArduino\stm32\OpenAMP\virtio_buffer.c.o
Compiling .pio\build\alfawise_U20\FrameworkArduino\stm32\OpenAMP\virtio_log.c.o
Compiling .pio\build\alfawise_U20\FrameworkArduino\stm32\startup_stm32yyxx.S.o
Compiling .pio\build\alfawise_U20\FrameworkArduino\stm32\usb\cdc\cdc_queue.c.o
Compiling .pio\build\alfawise_U20\FrameworkArduino\stm32\usb\cdc\usbd_cdc.c.o
Compiling .pio\build\alfawise_U20\FrameworkArduino\stm32\usb\cdc\usbd_cdc_if.c.o
Compiling .pio\build\alfawise_U20\FrameworkArduino\stm32\usb\hid\usbd_hid_composite.c.o
Compiling .pio\build\alfawise_U20\FrameworkArduino\stm32\usb\hid\usbd_hid_composite_if.c.o
Compiling .pio\build\alfawise_U20\FrameworkArduino\stm32\usb\usb_device_core.c.o
Compiling .pio\build\alfawise_U20\FrameworkArduino\stm32\usb\usb_device_ctlreq.c.o
Compiling .pio\build\alfawise_U20\FrameworkArduino\stm32\usb\usb_device_ioreq.c.o
Compiling .pio\build\alfawise_U20\FrameworkArduino\stm32\usb\usbd_conf.c.o
Compiling .pio\build\alfawise_U20\FrameworkArduino\stm32\usb\usbd_desc.c.o
Compiling .pio\build\alfawise_U20\FrameworkArduino\stm32\usb\usbd_ep_conf.c.o
Compiling .pio\build\alfawise_U20\FrameworkArduino\stm32\usb\usbd_if.c.o
Compiling .pio\build\alfawise_U20\FrameworkArduino\wiring_analog.c.o
Compiling .pio\build\alfawise_U20\FrameworkArduino\wiring_digital.c.o
Compiling .pio\build\alfawise_U20\FrameworkArduino\wiring_pulse.cpp.o
Compiling .pio\build\alfawise_U20\FrameworkArduino\wiring_shift.c.o
Compiling .pio\build\alfawise_U20\FrameworkArduino\wiring_time.c.o
Compiling .pio\build\alfawise_U20\SrcWrapper\src\HAL\stm32yyxx_hal.c.o
Compiling .pio\build\alfawise_U20\SrcWrapper\src\HAL\stm32yyxx_hal_adc.c.o
Compiling .pio\build\alfawise_U20\SrcWrapper\src\HAL\stm32yyxx_hal_adc_ex.c.o
Compiling .pio\build\alfawise_U20\SrcWrapper\src\HAL\stm32yyxx_hal_can.c.o
Compiling .pio\build\alfawise_U20\SrcWrapper\src\HAL\stm32yyxx_hal_cec.c.o
Compiling .pio\build\alfawise_U20\SrcWrapper\src\HAL\stm32yyxx_hal_comp.c.o
Compiling .pio\build\alfawise_U20\SrcWrapper\src\HAL\stm32yyxx_hal_comp_ex.c.o
Compiling .pio\build\alfawise_U20\SrcWrapper\src\HAL\stm32yyxx_hal_cordic.c.o
Compiling .pio\build\alfawise_U20\SrcWrapper\src\HAL\stm32yyxx_hal_cortex.c.o
Compiling .pio\build\alfawise_U20\SrcWrapper\src\HAL\stm32yyxx_hal_crc.c.o
Compiling .pio\build\alfawise_U20\SrcWrapper\src\HAL\stm32yyxx_hal_crc_ex.c.o
Compiling .pio\build\alfawise_U20\SrcWrapper\src\HAL\stm32yyxx_hal_cryp.c.o
Compiling .pio\build\alfawise_U20\SrcWrapper\src\HAL\stm32yyxx_hal_cryp_ex.c.o
Compiling .pio\build\alfawise_U20\SrcWrapper\src\HAL\stm32yyxx_hal_dac.c.o
Compiling .pio\build\alfawise_U20\SrcWrapper\src\HAL\stm32yyxx_hal_dac_ex.c.o
Compiling .pio\build\alfawise_U20\SrcWrapper\src\HAL\stm32yyxx_hal_dcmi.c.o
Compiling .pio\build\alfawise_U20\SrcWrapper\src\HAL\stm32yyxx_hal_dcmi_ex.c.o
Compiling .pio\build\alfawise_U20\SrcWrapper\src\HAL\stm32yyxx_hal_dfsdm.c.o
Compiling .pio\build\alfawise_U20\SrcWrapper\src\HAL\stm32yyxx_hal_dfsdm_ex.c.o
Compiling .pio\build\alfawise_U20\SrcWrapper\src\HAL\stm32yyxx_hal_dma.c.o
Compiling .pio\build\alfawise_U20\SrcWrapper\src\HAL\stm32yyxx_hal_dma2d.c.o
Compiling .pio\build\alfawise_U20\SrcWrapper\src\HAL\stm32yyxx_hal_dma_ex.c.o
Compiling .pio\build\alfawise_U20\SrcWrapper\src\HAL\stm32yyxx_hal_dsi.c.o
Compiling .pio\build\alfawise_U20\SrcWrapper\src\HAL\stm32yyxx_hal_dts.c.o
Compiling .pio\build\alfawise_U20\SrcWrapper\src\HAL\stm32yyxx_hal_eth.c.o
Compiling .pio\build\alfawise_U20\SrcWrapper\src\HAL\stm32yyxx_hal_eth_ex.c.o
Compiling .pio\build\alfawise_U20\SrcWrapper\src\HAL\stm32yyxx_hal_exti.c.o
Compiling .pio\build\alfawise_U20\SrcWrapper\src\HAL\stm32yyxx_hal_fdcan.c.o
Compiling .pio\build\alfawise_U20\SrcWrapper\src\HAL\stm32yyxx_hal_firewall.c.o
Compiling .pio\build\alfawise_U20\SrcWrapper\src\HAL\stm32yyxx_hal_flash.c.o
Compiling .pio\build\alfawise_U20\SrcWrapper\src\HAL\stm32yyxx_hal_flash_ex.c.o
Compiling .pio\build\alfawise_U20\SrcWrapper\src\HAL\stm32yyxx_hal_flash_ramfunc.c.o
Compiling .pio\build\alfawise_U20\SrcWrapper\src\HAL\stm32yyxx_hal_fmac.c.o
Compiling .pio\build\alfawise_U20\SrcWrapper\src\HAL\stm32yyxx_hal_fmpi2c.c.o
Compiling .pio\build\alfawise_U20\SrcWrapper\src\HAL\stm32yyxx_hal_fmpi2c_ex.c.o
Compiling .pio\build\alfawise_U20\SrcWrapper\src\HAL\stm32yyxx_hal_gfxmmu.c.o
Compiling .pio\build\alfawise_U20\SrcWrapper\src\HAL\stm32yyxx_hal_gpio.c.o
Compiling .pio\build\alfawise_U20\SrcWrapper\src\HAL\stm32yyxx_hal_gpio_ex.c.o
Compiling .pio\build\alfawise_U20\SrcWrapper\src\HAL\stm32yyxx_hal_hash.c.o
Compiling .pio\build\alfawise_U20\SrcWrapper\src\HAL\stm32yyxx_hal_hash_ex.c.o
Compiling .pio\build\alfawise_U20\SrcWrapper\src\HAL\stm32yyxx_hal_hcd.c.o
Compiling .pio\build\alfawise_U20\SrcWrapper\src\HAL\stm32yyxx_hal_hrtim.c.o
Compiling .pio\build\alfawise_U20\SrcWrapper\src\HAL\stm32yyxx_hal_hsem.c.o
Compiling .pio\build\alfawise_U20\SrcWrapper\src\HAL\stm32yyxx_hal_i2c.c.o
Compiling .pio\build\alfawise_U20\SrcWrapper\src\HAL\stm32yyxx_hal_i2c_ex.c.o
Compiling .pio\build\alfawise_U20\SrcWrapper\src\HAL\stm32yyxx_hal_i2s.c.o
Compiling .pio\build\alfawise_U20\SrcWrapper\src\HAL\stm32yyxx_hal_i2s_ex.c.o
Compiling .pio\build\alfawise_U20\SrcWrapper\src\HAL\stm32yyxx_hal_ipcc.c.o
Compiling .pio\build\alfawise_U20\SrcWrapper\src\HAL\stm32yyxx_hal_irda.c.o
Compiling .pio\build\alfawise_U20\SrcWrapper\src\HAL\stm32yyxx_hal_iwdg.c.o
Compiling .pio\build\alfawise_U20\SrcWrapper\src\HAL\stm32yyxx_hal_jpeg.c.o
Compiling .pio\build\alfawise_U20\SrcWrapper\src\HAL\stm32yyxx_hal_lcd.c.o
Compiling .pio\build\alfawise_U20\SrcWrapper\src\HAL\stm32yyxx_hal_lptim.c.o
Compiling .pio\build\alfawise_U20\SrcWrapper\src\HAL\stm32yyxx_hal_ltdc.c.o
Compiling .pio\build\alfawise_U20\SrcWrapper\src\HAL\stm32yyxx_hal_ltdc_ex.c.o
Compiling .pio\build\alfawise_U20\SrcWrapper\src\HAL\stm32yyxx_hal_mdios.c.o
Compiling .pio\build\alfawise_U20\SrcWrapper\src\HAL\stm32yyxx_hal_mdma.c.o
Compiling .pio\build\alfawise_U20\SrcWrapper\src\HAL\stm32yyxx_hal_mmc.c.o
Compiling .pio\build\alfawise_U20\SrcWrapper\src\HAL\stm32yyxx_hal_mmc_ex.c.o
Compiling .pio\build\alfawise_U20\SrcWrapper\src\HAL\stm32yyxx_hal_nand.c.o
Compiling .pio\build\alfawise_U20\SrcWrapper\src\HAL\stm32yyxx_hal_nor.c.o
Compiling .pio\build\alfawise_U20\SrcWrapper\src\HAL\stm32yyxx_hal_opamp.c.o
Compiling .pio\build\alfawise_U20\SrcWrapper\src\HAL\stm32yyxx_hal_opamp_ex.c.o
Compiling .pio\build\alfawise_U20\SrcWrapper\src\HAL\stm32yyxx_hal_ospi.c.o
Compiling .pio\build\alfawise_U20\SrcWrapper\src\HAL\stm32yyxx_hal_otfdec.c.o
Compiling .pio\build\alfawise_U20\SrcWrapper\src\HAL\stm32yyxx_hal_pccard.c.o
Compiling .pio\build\alfawise_U20\SrcWrapper\src\HAL\stm32yyxx_hal_pcd.c.o
Compiling .pio\build\alfawise_U20\SrcWrapper\src\HAL\stm32yyxx_hal_pcd_ex.c.o
Compiling .pio\build\alfawise_U20\SrcWrapper\src\HAL\stm32yyxx_hal_pka.c.o
Compiling .pio\build\alfawise_U20\SrcWrapper\src\HAL\stm32yyxx_hal_pssi.c.o
Compiling .pio\build\alfawise_U20\SrcWrapper\src\HAL\stm32yyxx_hal_pwr.c.o
Compiling .pio\build\alfawise_U20\SrcWrapper\src\HAL\stm32yyxx_hal_pwr_ex.c.o
Compiling .pio\build\alfawise_U20\SrcWrapper\src\HAL\stm32yyxx_hal_qspi.c.o
Compiling .pio\build\alfawise_U20\SrcWrapper\src\HAL\stm32yyxx_hal_ramecc.c.o
Compiling .pio\build\alfawise_U20\SrcWrapper\src\HAL\stm32yyxx_hal_rcc.c.o
Compiling .pio\build\alfawise_U20\SrcWrapper\src\HAL\stm32yyxx_hal_rcc_ex.c.o
Compiling .pio\build\alfawise_U20\SrcWrapper\src\HAL\stm32yyxx_hal_rng.c.o
Compiling .pio\build\alfawise_U20\SrcWrapper\src\HAL\stm32yyxx_hal_rng_ex.c.o
Compiling .pio\build\alfawise_U20\SrcWrapper\src\HAL\stm32yyxx_hal_rtc.c.o
Compiling .pio\build\alfawise_U20\SrcWrapper\src\HAL\stm32yyxx_hal_rtc_ex.c.o
Compiling .pio\build\alfawise_U20\SrcWrapper\src\HAL\stm32yyxx_hal_sai.c.o
Compiling .pio\build\alfawise_U20\SrcWrapper\src\HAL\stm32yyxx_hal_sai_ex.c.o
Compiling .pio\build\alfawise_U20\SrcWrapper\src\HAL\stm32yyxx_hal_sd.c.o
Compiling .pio\build\alfawise_U20\SrcWrapper\src\HAL\stm32yyxx_hal_sd_ex.c.o
Compiling .pio\build\alfawise_U20\SrcWrapper\src\HAL\stm32yyxx_hal_sdadc.c.o
Compiling .pio\build\alfawise_U20\SrcWrapper\src\HAL\stm32yyxx_hal_sdram.c.o
Compiling .pio\build\alfawise_U20\SrcWrapper\src\HAL\stm32yyxx_hal_smartcard.c.o
Compiling .pio\build\alfawise_U20\SrcWrapper\src\HAL\stm32yyxx_hal_smartcard_ex.c.o
Compiling .pio\build\alfawise_U20\SrcWrapper\src\HAL\stm32yyxx_hal_smbus.c.o
Compiling .pio\build\alfawise_U20\SrcWrapper\src\HAL\stm32yyxx_hal_spdifrx.c.o
Compiling .pio\build\alfawise_U20\SrcWrapper\src\HAL\stm32yyxx_hal_spi.c.o
Compiling .pio\build\alfawise_U20\SrcWrapper\src\HAL\stm32yyxx_hal_spi_ex.c.o
Compiling .pio\build\alfawise_U20\SrcWrapper\src\HAL\stm32yyxx_hal_sram.c.o
Compiling .pio\build\alfawise_U20\SrcWrapper\src\HAL\stm32yyxx_hal_swpmi.c.o
Compiling .pio\build\alfawise_U20\SrcWrapper\src\HAL\stm32yyxx_hal_tim.c.o
Compiling .pio\build\alfawise_U20\SrcWrapper\src\HAL\stm32yyxx_hal_tim_ex.c.o
Compiling .pio\build\alfawise_U20\SrcWrapper\src\HAL\stm32yyxx_hal_tsc.c.o
Compiling .pio\build\alfawise_U20\SrcWrapper\src\HAL\stm32yyxx_hal_uart.c.o
Compiling .pio\build\alfawise_U20\SrcWrapper\src\HAL\stm32yyxx_hal_uart_ex.c.o
Compiling .pio\build\alfawise_U20\SrcWrapper\src\HAL\stm32yyxx_hal_usart.c.o
Compiling .pio\build\alfawise_U20\SrcWrapper\src\HAL\stm32yyxx_hal_usart_ex.c.o
Compiling .pio\build\alfawise_U20\SrcWrapper\src\HAL\stm32yyxx_hal_wwdg.c.o
Compiling .pio\build\alfawise_U20\SrcWrapper\src\LL\stm32yyxx_ll_adc.c.o
Compiling .pio\build\alfawise_U20\SrcWrapper\src\LL\stm32yyxx_ll_bdma.c.o
Compiling .pio\build\alfawise_U20\SrcWrapper\src\LL\stm32yyxx_ll_comp.c.o
Compiling .pio\build\alfawise_U20\SrcWrapper\src\LL\stm32yyxx_ll_cordic.c.o
Compiling .pio\build\alfawise_U20\SrcWrapper\src\LL\stm32yyxx_ll_crc.c.o
Compiling .pio\build\alfawise_U20\SrcWrapper\src\LL\stm32yyxx_ll_crs.c.o
Compiling .pio\build\alfawise_U20\SrcWrapper\src\LL\stm32yyxx_ll_dac.c.o
Compiling .pio\build\alfawise_U20\SrcWrapper\src\LL\stm32yyxx_ll_delayblock.c.o
Compiling .pio\build\alfawise_U20\SrcWrapper\src\LL\stm32yyxx_ll_dma.c.o
Compiling .pio\build\alfawise_U20\SrcWrapper\src\LL\stm32yyxx_ll_dma2d.c.o
Compiling .pio\build\alfawise_U20\SrcWrapper\src\LL\stm32yyxx_ll_exti.c.o
Compiling .pio\build\alfawise_U20\SrcWrapper\src\LL\stm32yyxx_ll_fmac.c.o
Compiling .pio\build\alfawise_U20\SrcWrapper\src\LL\stm32yyxx_ll_fmc.c.o
Compiling .pio\build\alfawise_U20\SrcWrapper\src\LL\stm32yyxx_ll_fsmc.c.o
Compiling .pio\build\alfawise_U20\SrcWrapper\src\LL\stm32yyxx_ll_gpio.c.o
Compiling .pio\build\alfawise_U20\SrcWrapper\src\LL\stm32yyxx_ll_hrtim.c.o
Compiling .pio\build\alfawise_U20\SrcWrapper\src\LL\stm32yyxx_ll_i2c.c.o
Compiling .pio\build\alfawise_U20\SrcWrapper\src\LL\stm32yyxx_ll_lptim.c.o
Compiling .pio\build\alfawise_U20\SrcWrapper\src\LL\stm32yyxx_ll_lpuart.c.o
Compiling .pio\build\alfawise_U20\SrcWrapper\src\LL\stm32yyxx_ll_mdma.c.o
Compiling .pio\build\alfawise_U20\SrcWrapper\src\LL\stm32yyxx_ll_opamp.c.o
Compiling .pio\build\alfawise_U20\SrcWrapper\src\LL\stm32yyxx_ll_pka.c.o
Compiling .pio\build\alfawise_U20\SrcWrapper\src\LL\stm32yyxx_ll_pwr.c.o
Compiling .pio\build\alfawise_U20\SrcWrapper\src\LL\stm32yyxx_ll_rcc.c.o
Compiling .pio\build\alfawise_U20\SrcWrapper\src\LL\stm32yyxx_ll_rng.c.o
Compiling .pio\build\alfawise_U20\SrcWrapper\src\LL\stm32yyxx_ll_rtc.c.o
Compiling .pio\build\alfawise_U20\SrcWrapper\src\LL\stm32yyxx_ll_sdmmc.c.o
Compiling .pio\build\alfawise_U20\SrcWrapper\src\LL\stm32yyxx_ll_spi.c.o
Compiling .pio\build\alfawise_U20\SrcWrapper\src\LL\stm32yyxx_ll_swpmi.c.o
Compiling .pio\build\alfawise_U20\SrcWrapper\src\LL\stm32yyxx_ll_tim.c.o
Compiling .pio\build\alfawise_U20\SrcWrapper\src\LL\stm32yyxx_ll_ucpd.c.o
Compiling .pio\build\alfawise_U20\SrcWrapper\src\LL\stm32yyxx_ll_usart.c.o
Compiling .pio\build\alfawise_U20\SrcWrapper\src\LL\stm32yyxx_ll_usb.c.o
Compiling .pio\build\alfawise_U20\SrcWrapper\src\LL\stm32yyxx_ll_utils.c.o
Compiling .pio\build\alfawise_U20\SrcWrapper\src\stm32\PortNames.c.o
Compiling .pio\build\alfawise_U20\SrcWrapper\src\stm32\analog.cpp.o
Compiling .pio\build\alfawise_U20\SrcWrapper\src\stm32\bootloader.c.o
Compiling .pio\build\alfawise_U20\SrcWrapper\src\stm32\clock.c.o
Compiling .pio\build\alfawise_U20\SrcWrapper\src\stm32\core_callback.c.o
Compiling .pio\build\alfawise_U20\SrcWrapper\src\stm32\dwt.c.o
Compiling .pio\build\alfawise_U20\SrcWrapper\src\stm32\hw_config.c.o
Compiling .pio\build\alfawise_U20\SrcWrapper\src\stm32\interrupt.cpp.o
Compiling .pio\build\alfawise_U20\SrcWrapper\src\stm32\lock_resource.c.o
Compiling .pio\build\alfawise_U20\SrcWrapper\src\stm32\low_power.c.o
Compiling .pio\build\alfawise_U20\SrcWrapper\src\stm32\pinmap.c.o
Compiling .pio\build\alfawise_U20\SrcWrapper\src\stm32\rtc.c.o
Compiling .pio\build\alfawise_U20\SrcWrapper\src\stm32\stm32_def.c.o
Compiling .pio\build\alfawise_U20\SrcWrapper\src\stm32\stm32_eeprom.c.o
Compiling .pio\build\alfawise_U20\SrcWrapper\src\stm32\system_stm32yyxx.c.o
Compiling .pio\build\alfawise_U20\SrcWrapper\src\stm32\timer.c.o
Compiling .pio\build\alfawise_U20\SrcWrapper\src\stm32\uart.c.o
Compiling .pio\build\alfawise_U20\SrcWrapper\src\syscalls.c.o
Compiling .pio\build\alfawise_U20\src\src\HAL\HAL_STM32F1\HAL.cpp.o
Compiling .pio\build\alfawise_U20\src\src\HAL\HAL_STM32F1\HAL_Servo_STM32F1.cpp.o
Compiling .pio\build\alfawise_U20\src\src\HAL\HAL_STM32F1\HAL_sdio_STM32F1.cpp.o
Compiling .pio\build\alfawise_U20\src\src\HAL\HAL_STM32F1\HAL_spi_STM32F1.cpp.o
Compiling .pio\build\alfawise_U20\src\src\HAL\HAL_STM32F1\HAL_timers_STM32F1.cpp.o
Compiling .pio\build\alfawise_U20\src\src\HAL\HAL_STM32F1\SPI.cpp.o
Compiling .pio\build\alfawise_U20\src\src\HAL\HAL_STM32F1\SoftwareSerial.cpp.o
Compiling .pio\build\alfawise_U20\src\src\HAL\HAL_STM32F1\dogm\u8g_com_stm32duino_fsmc.cpp.o
Compiling .pio\build\alfawise_U20\src\src\HAL\HAL_STM32F1\persistent_store_eeprom.cpp.o
Compiling .pio\build\alfawise_U20\src\src\HAL\HAL_STM32F1\persistent_store_flash.cpp.o
Compiling .pio\build\alfawise_U20\src\src\HAL\HAL_STM32F1\persistent_store_sdcard.cpp.o
Compiling .pio\build\alfawise_U20\src\src\HAL\HAL_STM32F1\watchdog_STM32F1.cpp.o
Compiling .pio\build\alfawise_U20\src\src\HAL\shared\HAL_spi_L6470.cpp.o
Compiling .pio\build\alfawise_U20\src\src\HAL\shared\I2cEeprom.cpp.o
Compiling .pio\build\alfawise_U20\src\src\HAL\shared\SpiEeprom.cpp.o
Compiling .pio\build\alfawise_U20\src\src\HAL\shared\backtrace\backtrace.cpp.o
Compiling .pio\build\alfawise_U20\src\src\HAL\shared\backtrace\unwarm.cpp.o
Compiling .pio\build\alfawise_U20\src\src\HAL\shared\backtrace\unwarm_arm.cpp.o
Compiling .pio\build\alfawise_U20\src\src\HAL\shared\backtrace\unwarm_thumb.cpp.o
Compiling .pio\build\alfawise_U20\src\src\HAL\shared\backtrace\unwarmbytab.cpp.o
Compiling .pio\build\alfawise_U20\src\src\HAL\shared\backtrace\unwarmmem.cpp.o
Compiling .pio\build\alfawise_U20\src\src\HAL\shared\backtrace\unwinder.cpp.o
Compiling .pio\build\alfawise_U20\src\src\HAL\shared\backtrace\unwmemaccess.cpp.o
Compiling .pio\build\alfawise_U20\src\src\HAL\shared\persistent_store_api.cpp.o
Compiling .pio\build\alfawise_U20\src\src\HAL\shared\servo.cpp.o
In file included from C:\Users\DJ-LUDO62\.platformio\packages\framework-arduinoststm32\cores\arduino/WString.h:29,
                 from C:\Users\DJ-LUDO62\.platformio\packages\framework-arduinoststm32\cores\arduino/Print.h:27,
                 from C:\Users\DJ-LUDO62\.platformio\packages\framework-arduinoststm32\cores\arduino/Stream.h:26,
                 from C:\Users\DJ-LUDO62\.platformio\packages\framework-arduinoststm32\cores\arduino/HardwareSerial.h:29,
                 from C:\Users\DJ-LUDO62\.platformio\packages\framework-arduinoststm32\cores\arduino/WSerial.h:5,
                 from C:\Users\DJ-LUDO62\.platformio\packages\framework-arduinoststm32\cores\arduino/wiring.h:47,
                 from C:\Users\DJ-LUDO62\.platformio\packages\framework-arduinoststm32\cores\arduino/Arduino.h:36,
                 from c:\marlin_2.0\marlin\src\hal\shared\marduino.h:33,
                 from c:\marlin_2.0\marlin\src\hal\hal_stm32f1\hal.h:39,
                 from c:\marlin_2.0\marlin\src\inc\marlinconfig.h:30,
                 from Marlin\src\HAL\HAL_STM32F1\dogm\u8g_com_stm32duino_fsmc.cpp:29:
C:\Users\DJ-LUDO62\.platformio\packages\framework-arduinoststm32\cores\arduino/avr/pgmspace.h:74: warning: "snprintf_P" redefined
   74 | #define snprintf_P(s, n, ...) snprintf((s), (n), __VA_ARGS__)
      |
In file included from c:\marlin_2.0\marlin\src\inc\marlinconfig.h:30,
                 from Marlin\src\HAL\HAL_STM32F1\dogm\u8g_com_stm32duino_fsmc.cpp:29:
c:\marlin_2.0\marlin\src\hal\hal_stm32f1\hal.h:32: note: this is the location of the previous definition
   32 |   #define snprintf_P snprintf
      |
In file included from C:\Users\DJ-LUDO62\.platformio\packages\framework-arduinoststm32\cores\arduino/WString.h:29,
                 from C:\Users\DJ-LUDO62\.platformio\packages\framework-arduinoststm32\cores\arduino/Print.h:27,
                 from C:\Users\DJ-LUDO62\.platformio\packages\framework-arduinoststm32\cores\arduino/Stream.h:26,
                 from C:\Users\DJ-LUDO62\.platformio\packages\framework-arduinoststm32\cores\arduino/HardwareSerial.h:29,
                 from C:\Users\DJ-LUDO62\.platformio\packages\framework-arduinoststm32\cores\arduino/WSerial.h:5,
                 from C:\Users\DJ-LUDO62\.platformio\packages\framework-arduinoststm32\cores\arduino/wiring.h:47,
                 from C:\Users\DJ-LUDO62\.platformio\packages\framework-arduinoststm32\cores\arduino/Arduino.h:36,
                 from c:\marlin_2.0\marlin\src\hal\shared\marduino.h:33,
                 from c:\marlin_2.0\marlin\src\hal\hal_stm32f1\hal.h:39,
                 from c:\marlin_2.0\marlin\src\inc\marlinconfig.h:30,
                 from Marlin\src\HAL\HAL_STM32F1\dogm\u8g_com_stm32duino_fsmc.cpp:29:
C:\Users\DJ-LUDO62\.platformio\packages\framework-arduinoststm32\cores\arduino/avr/pgmspace.h:76: warning: "vsnprintf_P" redefined
   76 | #define vsnprintf_P(s, n, ...) vsnprintf((s), (n), __VA_ARGS__)
      |
In file included from c:\marlin_2.0\marlin\src\inc\marlinconfig.h:30,
                 from Marlin\src\HAL\HAL_STM32F1\dogm\u8g_com_stm32duino_fsmc.cpp:29:
c:\marlin_2.0\marlin\src\hal\hal_stm32f1\hal.h:35: note: this is the location of the previous definition
   35 |   #define vsnprintf_P vsnprintf
      |
In file included from c:\marlin_2.0\marlin\src\hal\hal_stm32f1\hal.h:43,
                 from c:\marlin_2.0\marlin\src\inc\marlinconfig.h:30,
                 from Marlin\src\HAL\HAL_STM32F1\dogm\u8g_com_stm32duino_fsmc.cpp:29:
c:\marlin_2.0\marlin\src\hal\hal_stm32f1\fastio_STM32F1.h:30:10: fatal error: libmaple/gpio.h: No such file or directory
   30 | #include <libmaple/gpio.h>
      |          ^~~~~~~~~~~~~~~~~
compilation terminated.
In file included from C:\Users\DJ-LUDO62\.platformio\packages\framework-arduinoststm32\cores\arduino/WString.h:29,
                 from C:\Users\DJ-LUDO62\.platformio\packages\framework-arduinoststm32\cores\arduino/Print.h:27,
                 from C:\Users\DJ-LUDO62\.platformio\packages\framework-arduinoststm32\cores\arduino/Stream.h:26,
                 from C:\Users\DJ-LUDO62\.platformio\packages\framework-arduinoststm32\cores\arduino/HardwareSerial.h:29,
                 from C:\Users\DJ-LUDO62\.platformio\packages\framework-arduinoststm32\cores\arduino/WSerial.h:5,
                 from C:\Users\DJ-LUDO62\.platformio\packages\framework-arduinoststm32\cores\arduino/wiring.h:47,
                 from C:\Users\DJ-LUDO62\.platformio\packages\framework-arduinoststm32\cores\arduino/Arduino.h:36,
                 from c:\marlin_2.0\marlin\src\hal\shared\marduino.h:33,
                 from c:\marlin_2.0\marlin\src\hal\hal_stm32f1\hal.h:39,
                 from c:\marlin_2.0\marlin\src\inc\marlinconfig.h:30,
                 from Marlin\src\HAL\shared\HAL_spi_L6470.cpp:28:
C:\Users\DJ-LUDO62\.platformio\packages\framework-arduinoststm32\cores\arduino/avr/pgmspace.h:74: warning: "snprintf_P" redefined
   74 | #define snprintf_P(s, n, ...) snprintf((s), (n), __VA_ARGS__)
      |
In file included from c:\marlin_2.0\marlin\src\inc\marlinconfig.h:30,
                 from Marlin\src\HAL\shared\HAL_spi_L6470.cpp:28:
c:\marlin_2.0\marlin\src\hal\hal_stm32f1\hal.h:32: note: this is the location of the previous definition
   32 |   #define snprintf_P snprintf
      |
In file included from C:\Users\DJ-LUDO62\.platformio\packages\framework-arduinoststm32\cores\arduino/WString.h:29,
                 from C:\Users\DJ-LUDO62\.platformio\packages\framework-arduinoststm32\cores\arduino/Print.h:27,
                 from C:\Users\DJ-LUDO62\.platformio\packages\framework-arduinoststm32\cores\arduino/Stream.h:26,
                 from C:\Users\DJ-LUDO62\.platformio\packages\framework-arduinoststm32\cores\arduino/HardwareSerial.h:29,
                 from C:\Users\DJ-LUDO62\.platformio\packages\framework-arduinoststm32\cores\arduino/WSerial.h:5,
                 from C:\Users\DJ-LUDO62\.platformio\packages\framework-arduinoststm32\cores\arduino/wiring.h:47,
                 from C:\Users\DJ-LUDO62\.platformio\packages\framework-arduinoststm32\cores\arduino/Arduino.h:36,
                 from c:\marlin_2.0\marlin\src\hal\shared\marduino.h:33,
                 from c:\marlin_2.0\marlin\src\hal\hal_stm32f1\hal.h:39,
                 from c:\marlin_2.0\marlin\src\inc\marlinconfig.h:30,
                 from Marlin\src\HAL\shared\HAL_spi_L6470.cpp:28:
C:\Users\DJ-LUDO62\.platformio\packages\framework-arduinoststm32\cores\arduino/avr/pgmspace.h:76: warning: "vsnprintf_P" redefined
   76 | #define vsnprintf_P(s, n, ...) vsnprintf((s), (n), __VA_ARGS__)
      |
In file included from c:\marlin_2.0\marlin\src\inc\marlinconfig.h:30,
                 from Marlin\src\HAL\shared\HAL_spi_L6470.cpp:28:
c:\marlin_2.0\marlin\src\hal\hal_stm32f1\hal.h:35: note: this is the location of the previous definition
   35 |   #define vsnprintf_P vsnprintf
      |
In file included from c:\marlin_2.0\marlin\src\hal\hal_stm32f1\hal.h:43,
                 from c:\marlin_2.0\marlin\src\inc\marlinconfig.h:30,
                 from Marlin\src\HAL\shared\HAL_spi_L6470.cpp:28:
c:\marlin_2.0\marlin\src\hal\hal_stm32f1\fastio_STM32F1.h:30:10: fatal error: libmaple/gpio.h: No such file or directory
   30 | #include <libmaple/gpio.h>
      |          ^~~~~~~~~~~~~~~~~
compilation terminated.
In file included from C:\Users\DJ-LUDO62\.platformio\packages\framework-arduinoststm32\cores\arduino/WString.h:29,
                 from C:\Users\DJ-LUDO62\.platformio\packages\framework-arduinoststm32\cores\arduino/Print.h:27,
                 from C:\Users\DJ-LUDO62\.platformio\packages\framework-arduinoststm32\cores\arduino/Stream.h:26,
                 from C:\Users\DJ-LUDO62\.platformio\packages\framework-arduinoststm32\cores\arduino/HardwareSerial.h:29,
                 from C:\Users\DJ-LUDO62\.platformio\packages\framework-arduinoststm32\cores\arduino/WSerial.h:5,
                 from C:\Users\DJ-LUDO62\.platformio\packages\framework-arduinoststm32\cores\arduino/wiring.h:47,
                 from C:\Users\DJ-LUDO62\.platformio\packages\framework-arduinoststm32\cores\arduino/Arduino.h:36,
                 from c:\marlin_2.0\marlin\src\hal\shared\marduino.h:33,
                 from c:\marlin_2.0\marlin\src\hal\hal_stm32f1\hal.h:39,
                 from c:\marlin_2.0\marlin\src\inc\marlinconfig.h:30,
                 from Marlin\src\HAL\shared\I2cEeprom.cpp:28:
C:\Users\DJ-LUDO62\.platformio\packages\framework-arduinoststm32\cores\arduino/avr/pgmspace.h:74: warning: "snprintf_P" redefined
   74 | #define snprintf_P(s, n, ...) snprintf((s), (n), __VA_ARGS__)
      |
In file included from c:\marlin_2.0\marlin\src\inc\marlinconfig.h:30,
                 from Marlin\src\HAL\shared\I2cEeprom.cpp:28:
c:\marlin_2.0\marlin\src\hal\hal_stm32f1\hal.h:32: note: this is the location of the previous definition
   32 |   #define snprintf_P snprintf
      |
In file included from C:\Users\DJ-LUDO62\.platformio\packages\framework-arduinoststm32\cores\arduino/WString.h:29,
                 from C:\Users\DJ-LUDO62\.platformio\packages\framework-arduinoststm32\cores\arduino/Print.h:27,
                 from C:\Users\DJ-LUDO62\.platformio\packages\framework-arduinoststm32\cores\arduino/Stream.h:26,
                 from C:\Users\DJ-LUDO62\.platformio\packages\framework-arduinoststm32\cores\arduino/HardwareSerial.h:29,
                 from C:\Users\DJ-LUDO62\.platformio\packages\framework-arduinoststm32\cores\arduino/WSerial.h:5,
                 from C:\Users\DJ-LUDO62\.platformio\packages\framework-arduinoststm32\cores\arduino/wiring.h:47,
                 from C:\Users\DJ-LUDO62\.platformio\packages\framework-arduinoststm32\cores\arduino/Arduino.h:36,
                 from c:\marlin_2.0\marlin\src\hal\shared\marduino.h:33,
                 from c:\marlin_2.0\marlin\src\hal\hal_stm32f1\hal.h:39,
                 from c:\marlin_2.0\marlin\src\inc\marlinconfig.h:30,
                 from Marlin\src\HAL\shared\I2cEeprom.cpp:28:
C:\Users\DJ-LUDO62\.platformio\packages\framework-arduinoststm32\cores\arduino/avr/pgmspace.h:76: warning: "vsnprintf_P" redefined
   76 | #define vsnprintf_P(s, n, ...) vsnprintf((s), (n), __VA_ARGS__)
      |
In file included from c:\marlin_2.0\marlin\src\inc\marlinconfig.h:30,
                 from Marlin\src\HAL\shared\I2cEeprom.cpp:28:
c:\marlin_2.0\marlin\src\hal\hal_stm32f1\hal.h:35: note: this is the location of the previous definition
   35 |   #define vsnprintf_P vsnprintf
      |
In file included from c:\marlin_2.0\marlin\src\hal\hal_stm32f1\hal.h:43,
                 from c:\marlin_2.0\marlin\src\inc\marlinconfig.h:30,
                 from Marlin\src\HAL\shared\I2cEeprom.cpp:28:
c:\marlin_2.0\marlin\src\hal\hal_stm32f1\fastio_STM32F1.h:30:10: fatal error: libmaple/gpio.h: No such file or directory
   30 | #include <libmaple/gpio.h>
      |          ^~~~~~~~~~~~~~~~~
compilation terminated.
Compiling .pio\build\alfawise_U20\src\src\Marlin.cpp.o
In file included from C:\Users\DJ-LUDO62\.platformio\packages\framework-arduinoststm32\cores\arduino/WString.h:29,
                 from C:\Users\DJ-LUDO62\.platformio\packages\framework-arduinoststm32\cores\arduino/Print.h:27,
                 from C:\Users\DJ-LUDO62\.platformio\packages\framework-arduinoststm32\cores\arduino/Stream.h:26,
                 from C:\Users\DJ-LUDO62\.platformio\packages\framework-arduinoststm32\cores\arduino/HardwareSerial.h:29,
                 from C:\Users\DJ-LUDO62\.platformio\packages\framework-arduinoststm32\cores\arduino/WSerial.h:5,
                 from C:\Users\DJ-LUDO62\.platformio\packages\framework-arduinoststm32\cores\arduino/wiring.h:47,
Compiling .pio\build\alfawise_U20\src\src\core\serial.cpp.o
                 from C:\Users\DJ-LUDO62\.platformio\packages\framework-arduinoststm32\cores\arduino/Arduino.h:36,
                 from c:\marlin_2.0\marlin\src\hal\shared\marduino.h:33,
                 from c:\marlin_2.0\marlin\src\hal\hal_stm32f1\hal.h:39,
                 from c:\marlin_2.0\marlin\src\inc\marlinconfig.h:30,
                 from Marlin\src\HAL\shared\SpiEeprom.cpp:28:
C:\Users\DJ-LUDO62\.platformio\packages\framework-arduinoststm32\cores\arduino/avr/pgmspace.h:74: warning: "snprintf_P" redefined
   74 | #define snprintf_P(s, n, ...) snprintf((s), (n), __VA_ARGS__)
      |
In file included from c:\marlin_2.0\marlin\src\inc\marlinconfig.h:30,
                 from Marlin\src\HAL\shared\SpiEeprom.cpp:28:
c:\marlin_2.0\marlin\src\hal\hal_stm32f1\hal.h:32: note: this is the location of the previous definition
   32 |   #define snprintf_P snprintf
      |
In file included from C:\Users\DJ-LUDO62\.platformio\packages\framework-arduinoststm32\cores\arduino/WString.h:29,
                 from C:\Users\DJ-LUDO62\.platformio\packages\framework-arduinoststm32\cores\arduino/Print.h:27,
                 from C:\Users\DJ-LUDO62\.platformio\packages\framework-arduinoststm32\cores\arduino/Stream.h:26,
                 from C:\Users\DJ-LUDO62\.platformio\packages\framework-arduinoststm32\cores\arduino/HardwareSerial.h:29,
                 from C:\Users\DJ-LUDO62\.platformio\packages\framework-arduinoststm32\cores\arduino/WSerial.h:5,
                 from C:\Users\DJ-LUDO62\.platformio\packages\framework-arduinoststm32\cores\arduino/wiring.h:47,
                 from C:\Users\DJ-LUDO62\.platformio\packages\framework-arduinoststm32\cores\arduino/Arduino.h:36,
                 from c:\marlin_2.0\marlin\src\hal\shared\marduino.h:33,
                 from c:\marlin_2.0\marlin\src\hal\hal_stm32f1\hal.h:39,
                 from c:\marlin_2.0\marlin\src\inc\marlinconfig.h:30,
                 from Marlin\src\HAL\shared\SpiEeprom.cpp:28:
C:\Users\DJ-LUDO62\.platformio\packages\framework-arduinoststm32\cores\arduino/avr/pgmspace.h:76: warning: "vsnprintf_P" redefined
   76 | #define vsnprintf_P(s, n, ...) vsnprintf((s), (n), __VA_ARGS__)
      |
In file included from c:\marlin_2.0\marlin\src\inc\marlinconfig.h:30,
                 from Marlin\src\HAL\shared\SpiEeprom.cpp:28:
c:\marlin_2.0\marlin\src\hal\hal_stm32f1\hal.h:35: note: this is the location of the previous definition
   35 |   #define vsnprintf_P vsnprintf
      |
In file included from c:\marlin_2.0\marlin\src\hal\hal_stm32f1\hal.h:43,
                 from c:\marlin_2.0\marlin\src\inc\marlinconfig.h:30,
                 from Marlin\src\HAL\shared\SpiEeprom.cpp:28:
c:\marlin_2.0\marlin\src\hal\hal_stm32f1\fastio_STM32F1.h:30:10: fatal error: libmaple/gpio.h: No such file or directory
   30 | #include <libmaple/gpio.h>
      |          ^~~~~~~~~~~~~~~~~
compilation terminated.
Compiling .pio\build\alfawise_U20\src\src\core\utility.cpp.o
*** [.pio\build\alfawise_U20\src\src\HAL\HAL_STM32F1\dogm\u8g_com_stm32duino_fsmc.cpp.o] Error 1
*** [.pio\build\alfawise_U20\src\src\HAL\shared\HAL_spi_L6470.cpp.o] Error 1
*** [.pio\build\alfawise_U20\src\src\HAL\shared\I2cEeprom.cpp.o] Error 1
*** [.pio\build\alfawise_U20\src\src\HAL\shared\SpiEeprom.cpp.o] Error 1
In file included from C:\Users\DJ-LUDO62\.platformio\packages\framework-arduinoststm32\cores\arduino/WString.h:29,
                 from C:\Users\DJ-LUDO62\.platformio\packages\framework-arduinoststm32\cores\arduino/Print.h:27,
                 from C:\Users\DJ-LUDO62\.platformio\packages\framework-arduinoststm32\cores\arduino/Stream.h:26,
                 from C:\Users\DJ-LUDO62\.platformio\packages\framework-arduinoststm32\cores\arduino/HardwareSerial.h:29,
                 from C:\Users\DJ-LUDO62\.platformio\packages\framework-arduinoststm32\cores\arduino/WSerial.h:5,
                 from C:\Users\DJ-LUDO62\.platformio\packages\framework-arduinoststm32\cores\arduino/wiring.h:47,
                 from C:\Users\DJ-LUDO62\.platformio\packages\framework-arduinoststm32\cores\arduino/Arduino.h:36,
                 from c:\marlin_2.0\marlin\src\hal\shared\marduino.h:33,
                 from c:\marlin_2.0\marlin\src\hal\hal_stm32f1\hal.h:39,
                 from c:\marlin_2.0\marlin\src\core\serial.h:26,
                 from Marlin\src\HAL\shared\backtrace\backtrace.cpp:30:
C:\Users\DJ-LUDO62\.platformio\packages\framework-arduinoststm32\cores\arduino/avr/pgmspace.h:74: warning: "snprintf_P" redefined
   74 | #define snprintf_P(s, n, ...) snprintf((s), (n), __VA_ARGS__)
      |
In file included from c:\marlin_2.0\marlin\src\core\serial.h:26,
                 from Marlin\src\HAL\shared\backtrace\backtrace.cpp:30:
c:\marlin_2.0\marlin\src\hal\hal_stm32f1\hal.h:32: note: this is the location of the previous definition
   32 |   #define snprintf_P snprintf
      |
In file included from C:\Users\DJ-LUDO62\.platformio\packages\framework-arduinoststm32\cores\arduino/WString.h:29,
                 from C:\Users\DJ-LUDO62\.platformio\packages\framework-arduinoststm32\cores\arduino/Print.h:27,
                 from C:\Users\DJ-LUDO62\.platformio\packages\framework-arduinoststm32\cores\arduino/Stream.h:26,
                 from C:\Users\DJ-LUDO62\.platformio\packages\framework-arduinoststm32\cores\arduino/HardwareSerial.h:29,
                 from C:\Users\DJ-LUDO62\.platformio\packages\framework-arduinoststm32\cores\arduino/WSerial.h:5,
                 from C:\Users\DJ-LUDO62\.platformio\packages\framework-arduinoststm32\cores\arduino/wiring.h:47,
                 from C:\Users\DJ-LUDO62\.platformio\packages\framework-arduinoststm32\cores\arduino/Arduino.h:36,
                 from c:\marlin_2.0\marlin\src\hal\shared\marduino.h:33,
                 from c:\marlin_2.0\marlin\src\hal\hal_stm32f1\hal.h:39,
                 from c:\marlin_2.0\marlin\src\core\serial.h:26,
                 from Marlin\src\HAL\shared\backtrace\backtrace.cpp:30:
C:\Users\DJ-LUDO62\.platformio\packages\framework-arduinoststm32\cores\arduino/avr/pgmspace.h:76: warning: "vsnprintf_P" redefined
   76 | #define vsnprintf_P(s, n, ...) vsnprintf((s), (n), __VA_ARGS__)
      |
In file included from c:\marlin_2.0\marlin\src\core\serial.h:26,
                 from Marlin\src\HAL\shared\backtrace\backtrace.cpp:30:
c:\marlin_2.0\marlin\src\hal\hal_stm32f1\hal.h:35: note: this is the location of the previous definition
   35 |   #define vsnprintf_P vsnprintf
      |
In file included from c:\marlin_2.0\marlin\src\hal\hal_stm32f1\hal.h:43,
                 from c:\marlin_2.0\marlin\src\core\serial.h:26,
                 from Marlin\src\HAL\shared\backtrace\backtrace.cpp:30:
c:\marlin_2.0\marlin\src\hal\hal_stm32f1\fastio_STM32F1.h:30:10: fatal error: libmaple/gpio.h: No such file or directory
   30 | #include <libmaple/gpio.h>
      |          ^~~~~~~~~~~~~~~~~
compilation terminated.
*** [.pio\build\alfawise_U20\src\src\HAL\shared\backtrace\backtrace.cpp.o] Error 1
In file included from C:\Users\DJ-LUDO62\.platformio\packages\framework-arduinoststm32\cores\arduino/WString.h:29,
                 from C:\Users\DJ-LUDO62\.platformio\packages\framework-arduinoststm32\cores\arduino/Print.h:27,
                 from C:\Users\DJ-LUDO62\.platformio\packages\framework-arduinoststm32\cores\arduino/Stream.h:26,
                 from C:\Users\DJ-LUDO62\.platformio\packages\framework-arduinoststm32\cores\arduino/HardwareSerial.h:29,
                 from C:\Users\DJ-LUDO62\.platformio\packages\framework-arduinoststm32\cores\arduino/WSerial.h:5,
                 from C:\Users\DJ-LUDO62\.platformio\packages\framework-arduinoststm32\cores\arduino/wiring.h:47,
                 from C:\Users\DJ-LUDO62\.platformio\packages\framework-arduinoststm32\cores\arduino/Arduino.h:36,
                 from c:\marlin_2.0\marlin\src\hal\shared\marduino.h:33,
                 from c:\marlin_2.0\marlin\src\hal\hal_stm32f1\hal.h:39,
                 from c:\marlin_2.0\marlin\src\inc\marlinconfig.h:30,
                 from Marlin\src\HAL\shared\backtrace\unwmemaccess.cpp:18:
C:\Users\DJ-LUDO62\.platformio\packages\framework-arduinoststm32\cores\arduino/avr/pgmspace.h:74: warning: "snprintf_P" redefined
   74 | #define snprintf_P(s, n, ...) snprintf((s), (n), __VA_ARGS__)
      |
In file included from c:\marlin_2.0\marlin\src\inc\marlinconfig.h:30,
                 from Marlin\src\HAL\shared\backtrace\unwmemaccess.cpp:18:
c:\marlin_2.0\marlin\src\hal\hal_stm32f1\hal.h:32: note: this is the location of the previous definition
   32 |   #define snprintf_P snprintf
      |
In file included from C:\Users\DJ-LUDO62\.platformio\packages\framework-arduinoststm32\cores\arduino/WString.h:29,
                 from C:\Users\DJ-LUDO62\.platformio\packages\framework-arduinoststm32\cores\arduino/Print.h:27,
                 from C:\Users\DJ-LUDO62\.platformio\packages\framework-arduinoststm32\cores\arduino/Stream.h:26,
                 from C:\Users\DJ-LUDO62\.platformio\packages\framework-arduinoststm32\cores\arduino/HardwareSerial.h:29,
                 from C:\Users\DJ-LUDO62\.platformio\packages\framework-arduinoststm32\cores\arduino/WSerial.h:5,
                 from C:\Users\DJ-LUDO62\.platformio\packages\framework-arduinoststm32\cores\arduino/wiring.h:47,
                 from C:\Users\DJ-LUDO62\.platformio\packages\framework-arduinoststm32\cores\arduino/Arduino.h:36,
                 from c:\marlin_2.0\marlin\src\hal\shared\marduino.h:33,
                 from c:\marlin_2.0\marlin\src\hal\hal_stm32f1\hal.h:39,
                 from c:\marlin_2.0\marlin\src\inc\marlinconfig.h:30,
                 from Marlin\src\HAL\shared\backtrace\unwmemaccess.cpp:18:
C:\Users\DJ-LUDO62\.platformio\packages\framework-arduinoststm32\cores\arduino/avr/pgmspace.h:76: warning: "vsnprintf_P" redefined
   76 | #define vsnprintf_P(s, n, ...) vsnprintf((s), (n), __VA_ARGS__)
      |
In file included from c:\marlin_2.0\marlin\src\inc\marlinconfig.h:30,
                 from Marlin\src\HAL\shared\backtrace\unwmemaccess.cpp:18:
c:\marlin_2.0\marlin\src\hal\hal_stm32f1\hal.h:35: note: this is the location of the previous definition
   35 |   #define vsnprintf_P vsnprintf
      |
In file included from c:\marlin_2.0\marlin\src\hal\hal_stm32f1\hal.h:43,
                 from c:\marlin_2.0\marlin\src\inc\marlinconfig.h:30,
                 from Marlin\src\HAL\shared\backtrace\unwmemaccess.cpp:18:
c:\marlin_2.0\marlin\src\hal\hal_stm32f1\fastio_STM32F1.h:30:10: fatal error: libmaple/gpio.h: No such file or directory
   30 | #include <libmaple/gpio.h>
      |          ^~~~~~~~~~~~~~~~~
compilation terminated.
*** [.pio\build\alfawise_U20\src\src\HAL\shared\backtrace\unwmemaccess.cpp.o] Error 1
In file included from C:\Users\DJ-LUDO62\.platformio\packages\framework-arduinoststm32\cores\arduino/WString.h:29,
                 from C:\Users\DJ-LUDO62\.platformio\packages\framework-arduinoststm32\cores\arduino/Print.h:27,
                 from C:\Users\DJ-LUDO62\.platformio\packages\framework-arduinoststm32\cores\arduino/Stream.h:26,
                 from C:\Users\DJ-LUDO62\.platformio\packages\framework-arduinoststm32\cores\arduino/HardwareSerial.h:29,
                 from C:\Users\DJ-LUDO62\.platformio\packages\framework-arduinoststm32\cores\arduino/WSerial.h:5,
                 from C:\Users\DJ-LUDO62\.platformio\packages\framework-arduinoststm32\cores\arduino/wiring.h:47,
                 from C:\Users\DJ-LUDO62\.platformio\packages\framework-arduinoststm32\cores\arduino/Arduino.h:36,
                 from c:\marlin_2.0\marlin\src\hal\shared\marduino.h:33,
                 from c:\marlin_2.0\marlin\src\hal\hal_stm32f1\hal.h:39,
                 from c:\marlin_2.0\marlin\src\inc\marlinconfig.h:30,
                 from Marlin\src\HAL\shared\servo.cpp:54:
C:\Users\DJ-LUDO62\.platformio\packages\framework-arduinoststm32\cores\arduino/avr/pgmspace.h:74: warning: "snprintf_P" redefined
   74 | #define snprintf_P(s, n, ...) snprintf((s), (n), __VA_ARGS__)
      |
In file included from c:\marlin_2.0\marlin\src\inc\marlinconfig.h:30,
                 from Marlin\src\HAL\shared\servo.cpp:54:
c:\marlin_2.0\marlin\src\hal\hal_stm32f1\hal.h:32: note: this is the location of the previous definition
   32 |   #define snprintf_P snprintf
      |
In file included from C:\Users\DJ-LUDO62\.platformio\packages\framework-arduinoststm32\cores\arduino/WString.h:29,
                 from C:\Users\DJ-LUDO62\.platformio\packages\framework-arduinoststm32\cores\arduino/Print.h:27,
                 from C:\Users\DJ-LUDO62\.platformio\packages\framework-arduinoststm32\cores\arduino/Stream.h:26,
                 from C:\Users\DJ-LUDO62\.platformio\packages\framework-arduinoststm32\cores\arduino/HardwareSerial.h:29,
                 from C:\Users\DJ-LUDO62\.platformio\packages\framework-arduinoststm32\cores\arduino/WSerial.h:5,
                 from C:\Users\DJ-LUDO62\.platformio\packages\framework-arduinoststm32\cores\arduino/wiring.h:47,
                 from C:\Users\DJ-LUDO62\.platformio\packages\framework-arduinoststm32\cores\arduino/Arduino.h:36,
                 from c:\marlin_2.0\marlin\src\hal\shared\marduino.h:33,
                 from c:\marlin_2.0\marlin\src\hal\hal_stm32f1\hal.h:39,
                 from c:\marlin_2.0\marlin\src\inc\marlinconfig.h:30,
                 from Marlin\src\HAL\shared\servo.cpp:54:
C:\Users\DJ-LUDO62\.platformio\packages\framework-arduinoststm32\cores\arduino/avr/pgmspace.h:76: warning: "vsnprintf_P" redefined
   76 | #define vsnprintf_P(s, n, ...) vsnprintf((s), (n), __VA_ARGS__)
      |
In file included from c:\marlin_2.0\marlin\src\inc\marlinconfig.h:30,
                 from Marlin\src\HAL\shared\servo.cpp:54:
c:\marlin_2.0\marlin\src\hal\hal_stm32f1\hal.h:35: note: this is the location of the previous definition
   35 |   #define vsnprintf_P vsnprintf
      |
In file included from c:\marlin_2.0\marlin\src\hal\hal_stm32f1\hal.h:43,
                 from c:\marlin_2.0\marlin\src\inc\marlinconfig.h:30,
                 from Marlin\src\HAL\shared\servo.cpp:54:
c:\marlin_2.0\marlin\src\hal\hal_stm32f1\fastio_STM32F1.h:30:10: fatal error: libmaple/gpio.h: No such file or directory
   30 | #include <libmaple/gpio.h>
      |          ^~~~~~~~~~~~~~~~~
compilation terminated.
*** [.pio\build\alfawise_U20\src\src\HAL\shared\servo.cpp.o] Error 1
In file included from C:\Users\DJ-LUDO62\.platformio\packages\framework-arduinoststm32\cores\arduino/WString.h:29,
                 from C:\Users\DJ-LUDO62\.platformio\packages\framework-arduinoststm32\cores\arduino/Print.h:27,
                 from C:\Users\DJ-LUDO62\.platformio\packages\framework-arduinoststm32\cores\arduino/Stream.h:26,
                 from C:\Users\DJ-LUDO62\.platformio\packages\framework-arduinoststm32\cores\arduino/HardwareSerial.h:29,
                 from C:\Users\DJ-LUDO62\.platformio\packages\framework-arduinoststm32\cores\arduino/WSerial.h:5,
                 from C:\Users\DJ-LUDO62\.platformio\packages\framework-arduinoststm32\cores\arduino/wiring.h:47,
                 from C:\Users\DJ-LUDO62\.platformio\packages\framework-arduinoststm32\cores\arduino/Arduino.h:36,
                 from c:\marlin_2.0\marlin\src\hal\shared\marduino.h:33,
                 from Marlin\src\inc/../HAL/HAL_STM32F1/HAL.h:39,
                 from Marlin\src\inc/MarlinConfig.h:30,
                 from Marlin\src\Marlin.h:24,
                 from Marlin\src\Marlin.cpp:31:
C:\Users\DJ-LUDO62\.platformio\packages\framework-arduinoststm32\cores\arduino/avr/pgmspace.h:74: warning: "snprintf_P" redefined
   74 | #define snprintf_P(s, n, ...) snprintf((s), (n), __VA_ARGS__)
      |
In file included from Marlin\src\inc/MarlinConfig.h:30,
                 from Marlin\src\Marlin.h:24,
                 from Marlin\src\Marlin.cpp:31:
Marlin\src\inc/../HAL/HAL_STM32F1/HAL.h:32: note: this is the location of the previous definition
   32 |   #define snprintf_P snprintf
      |
In file included from C:\Users\DJ-LUDO62\.platformio\packages\framework-arduinoststm32\cores\arduino/WString.h:29,
                 from C:\Users\DJ-LUDO62\.platformio\packages\framework-arduinoststm32\cores\arduino/Print.h:27,
                 from C:\Users\DJ-LUDO62\.platformio\packages\framework-arduinoststm32\cores\arduino/Stream.h:26,
                 from C:\Users\DJ-LUDO62\.platformio\packages\framework-arduinoststm32\cores\arduino/HardwareSerial.h:29,
                 from C:\Users\DJ-LUDO62\.platformio\packages\framework-arduinoststm32\cores\arduino/WSerial.h:5,
                 from C:\Users\DJ-LUDO62\.platformio\packages\framework-arduinoststm32\cores\arduino/wiring.h:47,
                 from C:\Users\DJ-LUDO62\.platformio\packages\framework-arduinoststm32\cores\arduino/Arduino.h:36,
                 from c:\marlin_2.0\marlin\src\hal\shared\marduino.h:33,
                 from Marlin\src\inc/../HAL/HAL_STM32F1/HAL.h:39,
                 from Marlin\src\inc/MarlinConfig.h:30,
                 from Marlin\src\Marlin.h:24,
                 from Marlin\src\Marlin.cpp:31:
C:\Users\DJ-LUDO62\.platformio\packages\framework-arduinoststm32\cores\arduino/avr/pgmspace.h:76: warning: "vsnprintf_P" redefined
   76 | #define vsnprintf_P(s, n, ...) vsnprintf((s), (n), __VA_ARGS__)
      |
In file included from Marlin\src\inc/MarlinConfig.h:30,
                 from Marlin\src\Marlin.h:24,
                 from Marlin\src\Marlin.cpp:31:
Marlin\src\inc/../HAL/HAL_STM32F1/HAL.h:35: note: this is the location of the previous definition
   35 |   #define vsnprintf_P vsnprintf
      |
In file included from Marlin\src\inc/../HAL/HAL_STM32F1/HAL.h:43,
                 from Marlin\src\inc/MarlinConfig.h:30,
                 from Marlin\src\Marlin.h:24,
                 from Marlin\src\Marlin.cpp:31:
Marlin\src\inc/../HAL/HAL_STM32F1/fastio_STM32F1.h:30:10: fatal error: libmaple/gpio.h: No such file or directory
   30 | #include <libmaple/gpio.h>
      |          ^~~~~~~~~~~~~~~~~
compilation terminated.
*** [.pio\build\alfawise_U20\src\src\Marlin.cpp.o] Error 1
In file included from C:\Users\DJ-LUDO62\.platformio\packages\framework-arduinoststm32\cores\arduino/WString.h:29,
                 from C:\Users\DJ-LUDO62\.platformio\packages\framework-arduinoststm32\cores\arduino/Print.h:27,
                 from C:\Users\DJ-LUDO62\.platformio\packages\framework-arduinoststm32\cores\arduino/Stream.h:26,
                 from C:\Users\DJ-LUDO62\.platformio\packages\framework-arduinoststm32\cores\arduino/HardwareSerial.h:29,
                 from C:\Users\DJ-LUDO62\.platformio\packages\framework-arduinoststm32\cores\arduino/WSerial.h:5,
                 from C:\Users\DJ-LUDO62\.platformio\packages\framework-arduinoststm32\cores\arduino/wiring.h:47,
                 from C:\Users\DJ-LUDO62\.platformio\packages\framework-arduinoststm32\cores\arduino/Arduino.h:36,
                 from c:\marlin_2.0\marlin\src\hal\shared\marduino.h:33,
                 from Marlin\src\core\../HAL/HAL_STM32F1/HAL.h:39,
                 from Marlin\src\core\serial.h:26,
                 from Marlin\src\core\serial.cpp:23:
C:\Users\DJ-LUDO62\.platformio\packages\framework-arduinoststm32\cores\arduino/avr/pgmspace.h:74: warning: "snprintf_P" redefined
   74 | #define snprintf_P(s, n, ...) snprintf((s), (n), __VA_ARGS__)
      |
In file included from Marlin\src\core\serial.h:26,
                 from Marlin\src\core\serial.cpp:23:
Marlin\src\core\../HAL/HAL_STM32F1/HAL.h:32: note: this is the location of the previous definition
   32 |   #define snprintf_P snprintf
      |
In file included from C:\Users\DJ-LUDO62\.platformio\packages\framework-arduinoststm32\cores\arduino/WString.h:29,
                 from C:\Users\DJ-LUDO62\.platformio\packages\framework-arduinoststm32\cores\arduino/Print.h:27,
                 from C:\Users\DJ-LUDO62\.platformio\packages\framework-arduinoststm32\cores\arduino/Stream.h:26,
                 from C:\Users\DJ-LUDO62\.platformio\packages\framework-arduinoststm32\cores\arduino/HardwareSerial.h:29,
                 from C:\Users\DJ-LUDO62\.platformio\packages\framework-arduinoststm32\cores\arduino/WSerial.h:5,
                 from C:\Users\DJ-LUDO62\.platformio\packages\framework-arduinoststm32\cores\arduino/wiring.h:47,
                 from C:\Users\DJ-LUDO62\.platformio\packages\framework-arduinoststm32\cores\arduino/Arduino.h:36,
                 from c:\marlin_2.0\marlin\src\hal\shared\marduino.h:33,
                 from Marlin\src\core\../HAL/HAL_STM32F1/HAL.h:39,
                 from Marlin\src\core\serial.h:26,
                 from Marlin\src\core\serial.cpp:23:
C:\Users\DJ-LUDO62\.platformio\packages\framework-arduinoststm32\cores\arduino/avr/pgmspace.h:76: warning: "vsnprintf_P" redefined
   76 | #define vsnprintf_P(s, n, ...) vsnprintf((s), (n), __VA_ARGS__)
      |
In file included from Marlin\src\core\serial.h:26,
                 from Marlin\src\core\serial.cpp:23:
Marlin\src\core\../HAL/HAL_STM32F1/HAL.h:35: note: this is the location of the previous definition
   35 |   #define vsnprintf_P vsnprintf
      |
In file included from Marlin\src\core\../HAL/HAL_STM32F1/HAL.h:43,
                 from Marlin\src\core\serial.h:26,
                 from Marlin\src\core\serial.cpp:23:
Marlin\src\core\../HAL/HAL_STM32F1/fastio_STM32F1.h:30:10: fatal error: libmaple/gpio.h: No such file or directory
   30 | #include <libmaple/gpio.h>
      |          ^~~~~~~~~~~~~~~~~
compilation terminated.
In file included from C:\Users\DJ-LUDO62\.platformio\packages\framework-arduinoststm32\cores\arduino/WString.h:29,
                 from C:\Users\DJ-LUDO62\.platformio\packages\framework-arduinoststm32\cores\arduino/Print.h:27,
                 from C:\Users\DJ-LUDO62\.platformio\packages\framework-arduinoststm32\cores\arduino/Stream.h:26,
                 from C:\Users\DJ-LUDO62\.platformio\packages\framework-arduinoststm32\cores\arduino/HardwareSerial.h:29,
                 from C:\Users\DJ-LUDO62\.platformio\packages\framework-arduinoststm32\cores\arduino/WSerial.h:5,
                 from C:\Users\DJ-LUDO62\.platformio\packages\framework-arduinoststm32\cores\arduino/wiring.h:47,
                 from C:\Users\DJ-LUDO62\.platformio\packages\framework-arduinoststm32\cores\arduino/Arduino.h:36,
                 from c:\marlin_2.0\marlin\src\hal\shared\marduino.h:33,
                 from c:\marlin_2.0\marlin\src\hal\hal_stm32f1\hal.h:39,
                 from Marlin\src\core\../inc/MarlinConfig.h:30,
                 from Marlin\src\core\../Marlin.h:24,
                 from Marlin\src\core\utility.cpp:25:
C:\Users\DJ-LUDO62\.platformio\packages\framework-arduinoststm32\cores\arduino/avr/pgmspace.h:74: warning: "snprintf_P" redefined
   74 | #define snprintf_P(s, n, ...) snprintf((s), (n), __VA_ARGS__)
      |
In file included from Marlin\src\core\../inc/MarlinConfig.h:30,
                 from Marlin\src\core\../Marlin.h:24,
                 from Marlin\src\core\utility.cpp:25:
c:\marlin_2.0\marlin\src\hal\hal_stm32f1\hal.h:32: note: this is the location of the previous definition
   32 |   #define snprintf_P snprintf
      |
In file included from C:\Users\DJ-LUDO62\.platformio\packages\framework-arduinoststm32\cores\arduino/WString.h:29,
                 from C:\Users\DJ-LUDO62\.platformio\packages\framework-arduinoststm32\cores\arduino/Print.h:27,
                 from C:\Users\DJ-LUDO62\.platformio\packages\framework-arduinoststm32\cores\arduino/Stream.h:26,
                 from C:\Users\DJ-LUDO62\.platformio\packages\framework-arduinoststm32\cores\arduino/HardwareSerial.h:29,
                 from C:\Users\DJ-LUDO62\.platformio\packages\framework-arduinoststm32\cores\arduino/WSerial.h:5,
                 from C:\Users\DJ-LUDO62\.platformio\packages\framework-arduinoststm32\cores\arduino/wiring.h:47,
                 from C:\Users\DJ-LUDO62\.platformio\packages\framework-arduinoststm32\cores\arduino/Arduino.h:36,
                 from c:\marlin_2.0\marlin\src\hal\shared\marduino.h:33,
                 from c:\marlin_2.0\marlin\src\hal\hal_stm32f1\hal.h:39,
                 from Marlin\src\core\../inc/MarlinConfig.h:30,
                 from Marlin\src\core\../Marlin.h:24,
                 from Marlin\src\core\utility.cpp:25:
C:\Users\DJ-LUDO62\.platformio\packages\framework-arduinoststm32\cores\arduino/avr/pgmspace.h:76: warning: "vsnprintf_P" redefined
   76 | #define vsnprintf_P(s, n, ...) vsnprintf((s), (n), __VA_ARGS__)
      |
In file included from Marlin\src\core\../inc/MarlinConfig.h:30,
                 from Marlin\src\core\../Marlin.h:24,
                 from Marlin\src\core\utility.cpp:25:
c:\marlin_2.0\marlin\src\hal\hal_stm32f1\hal.h:35: note: this is the location of the previous definition
   35 |   #define vsnprintf_P vsnprintf
      |
In file included from c:\marlin_2.0\marlin\src\hal\hal_stm32f1\hal.h:43,
                 from Marlin\src\core\../inc/MarlinConfig.h:30,
                 from Marlin\src\core\../Marlin.h:24,
                 from Marlin\src\core\utility.cpp:25:
c:\marlin_2.0\marlin\src\hal\hal_stm32f1\fastio_STM32F1.h:30:10: fatal error: libmaple/gpio.h: No such file or directory
   30 | #include <libmaple/gpio.h>
      |          ^~~~~~~~~~~~~~~~~
compilation terminated.
*** [.pio\build\alfawise_U20\src\src\core\serial.cpp.o] Error 1
*** [.pio\build\alfawise_U20\src\src\core\utility.cpp.o] Error 1
========================================================== [FAILED] Took 15.24 seconds ==========================================================

Environment    Status    Duration
-------------  --------  ------------
alfawise_U20   FAILED    00:00:15.241

Lien à poster
Partager sur d’autres sites

Prends la dernière version (qui date d'hier) ici https://github.com/tpruvot/Marlin/tree/dev

sinon je crois qu'il faut ajouter platform = ststm32@~12.0 dans platformio.ini dans la section alfawise_U20 pour la branche master qui date de 2020

Il faut que tu aies ca dans le début du log :

PACKAGES:
 - framework-arduinoststm32-maple 3.10000.201129 (1.0.0)

Modifié (le) par Epsylon3
Lien à poster
Partager sur d’autres sites

Capture.JPG.751c845349a07ed84a145dcb0e608c2a.JPGBonjour, 
J'ai un souci avec la dernière compilation à faire.
Faut dire aussi que je ne suis pas très assidu à cette discussion, donc je dois manquer certaines choses voire mêmle oublier certaines manips.

Je suis sous win 7 pro 64bits.

Je suis actuellement sous 2.0.7.2 sans bl touch depuis novembre dernier et ça fonctionne très bien.

D'ailleurs à ce propos, quand ça marche bien est il nécessaire de mettre  à jour?

Bon, j'ai quand même voulu compiler cette dernière version mais je suis un peu paumé.

J'ai visual studio en français 1.55.2.

Quand je l'ai ouvert il ma demandé de mettre à jour le git, ce que j'ai fait.
Il m'a fait la même demande pour python avec la version 3.9.4-amd64 sauf que là il me veut pas l'installer, voici le message d'erreur:

Capture.JPG.751c845349a07ed84a145dcb0e608c2a.JPG

J'ai quand même essayé avec cette procédure:
J'ouvre visual puis ouvrir le dossier, je choisis celui du dernier marlin que je viens de télécharger, je vais sur le fichier platformio.ini puis je change U30 par U20, je vais dans "terminal" je clique sur " la tâche de build" et là il me dit:

"sélectionner la tâche de génération à exécuter"
"aucune tâche de génération à exécuter n'a été trouver, configurer la tâche de génération"

Voilà, que faire?

diiity

Modifié (le) par diiity
Lien à poster
Partager sur d’autres sites

Rejoindre la conversation

Vous pouvez poster un message et vous inscrire plus tard. Si vous avez déjà un compte, connectez-vous afin de poster avec.

Invité
Répondre à ce sujet…

×   Vous avez copié du contenu avec formatage.   Supprimer le formatage

  Only 75 emoji are allowed.

×   Votre lien a été automatiquement intégré.   Afficher en tant que lien à la place

×   Le contenu sauvegardé a été restauré.   Effacer l'éditeur

×   You cannot paste images directly. Upload or insert images from URL.


×
×
  • Créer...